program: Gaussian 09
title: 000264087
version: EM64L-G09RevD.01
frameworkgroup: C1[X(C16H18N4O5S)]
method: RPBEPBE
basis: SDD
operation: Freq
keyword: #p
keyword: freq=noraman
keyword: PBEPBE/SDD
title: #p freq=noraman PBEPBE/SDD
converged: YES YES NO NO
title: Mulliken charges:
elementType: S O O O O O N N N N C C C C C C C C C C C C C C C C H H H H H H H H H H H H H H H H H H
charge: 0.171054 -0.165088 -0.413221 -0.200284 -0.279078 -0.186396 -0.079311 -0.389560 0.031484 -0.424531 -0.473598 -0.116220 -0.181787 -0.141081 0.103283 -0.673390 -0.673735 0.177948 0.184994 0.260504 -0.241541 -0.484430 -0.353406 0.211771 0.216781 -0.784347 0.332353 0.303738 0.311569 0.250406 0.235785 0.231708 0.239062 0.258639 0.222016 0.327910 0.387206 0.284500 0.243370 0.229861 0.309570 0.256830 0.264921 0.213744
chargesum: 0.00000
title: Mulliken charges with hydrogens summed into heavy atoms:
elementType: S O O O O O N N N N C C C C C C C C C C C C C C C C
charge: 0.171054 -0.165088 -0.026016 -0.200284 -0.279078 -0.186396 -0.079311 -0.061650 0.031484 -0.114961 -0.141245 -0.116220 0.121950 0.170488 0.103283 0.044509 0.045982 0.177948 0.184994 0.260504 0.042959 -0.241059 -0.123546 0.211771 0.216781 -0.048852
polarizability: 3.51308295e+02 -6.42192716e+00 2.38553285e+02 -1.32535756e+00 -3.61409330e+00 1.56824588e+02
1716.lowfreq: -8.3421 -2.4856 -0.0009 0.0001 0.0006 3.2182 14.8722 21.0271 23.9506
frequency: 14.6063 21.0099 23.9056 34.7686 41.1453 50.8109 59.6062 61.6970 71.4022 81.5905 105.1961 110.6678 137.2650 145.5404 158.4544 195.6880 215.8980 247.1270 247.7044 251.2085 266.5842 288.9249 302.9653 307.1724 316.1923 341.7828 356.6070 375.6355 390.3512 407.9347 421.4313 460.3103 472.6868 482.1854 511.9967 525.8910 552.3760 560.2307 581.5267 583.2028 614.7933 616.4783 619.9978 623.8586 643.2334 682.4631 690.3355 702.5702 719.8614 761.9236 779.1734 809.8891 840.0299 848.9098 857.4651 865.3923 897.4819 919.0057 924.4901 930.2412 943.7385 950.4794 980.7715 986.8693 988.6855 992.6992 1009.2060 1033.1885 1035.9301 1071.7599 1088.1402 1114.7585 1136.4385 1162.3250 1173.9188 1185.4585 1195.5765 1197.7948 1208.9242 1231.0123 1242.9380 1245.0522 1261.9848 1271.1658 1283.3730 1320.4647 1332.2872 1336.7814 1358.0772 1366.2569 1382.1029 1384.1510 1403.5719 1443.2460 1457.8538 1459.3661 1466.6902 1468.5919 1475.7830 1478.1161 1487.8835 1503.8131 1549.4436 1592.4807 1598.2015 1661.9641 1667.0465 1728.5082 2979.1083 2987.5066 2989.8606 3055.8102 3069.4560 3074.5826 3077.8124 3084.7649 3098.5274 3101.7474 3106.3571 3124.9236 3128.0090 3133.3741 3169.2848 3508.2293 3515.3222 3538.3759
redmass: 6.7082 5.8389 5.3634 5.3057 5.8703 1.1478 4.2167 9.0144 6.3348 7.2834 7.6059 6.7318 5.8645 5.5451 6.9332 4.8688 4.8409 4.0316 5.8151 3.0193 1.3011 1.6336 3.4823 3.6320 2.5687 3.5985 5.3074 4.2226 4.0473 3.7386 5.7214 5.8554 6.4868 3.8425 3.1617 3.6062 4.1012 3.7573 3.0991 2.9473 1.7384 1.6403 1.2405 6.8812 3.2081 3.8928 4.5219 5.4799 6.4506 7.7097 5.0334 6.9194 3.2478 3.1783 2.4264 4.5419 4.1312 5.0897 1.6258 2.4046 1.5631 3.0522 3.6637 2.1006 2.4369 1.4610 1.5021 1.6714 2.6377 2.5507 3.2850 1.8414 1.3011 1.6104 2.4367 1.6528 2.7913 2.5338 1.9143 1.5146 1.5832 1.7463 1.7110 1.7460 3.3400 2.5867 2.9510 3.1754 1.9347 2.1003 1.2185 1.1944 1.1887 1.2289 1.0526 1.9052 1.0664 1.1980 1.0814 1.5585 1.0497 2.1709 4.1753 6.1198 6.1972 6.4343 9.0025 12.7673 1.0380 1.0363 1.0377 1.0841 1.0864 1.0957 1.0987 1.0987 1.1006 1.1003 1.0912 1.0983 1.0907 1.0906 1.0962 1.0641 1.0774 1.0764
irintensity: 1.9501 1.3816 7.7548 0.7754 4.6821 0.3690 0.5227 1.0654 2.2157 1.9571 6.7954 13.0837 1.9655 1.4199 0.7773 3.9161 1.6034 11.9717 0.3340 2.7838 0.0357 5.4433 0.8117 2.4596 7.8789 0.6866 17.1277 0.6872 0.8884 2.1930 8.2365 9.8047 2.4200 27.1654 12.7171 12.1120 14.3478 62.6725 17.2041 29.8998 43.2579 100.8696 69.4356 3.8456 15.7091 55.4373 12.1599 13.4596 21.0748 8.8669 16.3399 5.7228 10.4258 12.3056 32.5187 20.7718 22.0609 0.5822 4.7482 16.3529 4.2021 10.4094 5.0128 35.0774 14.8850 4.4583 19.0164 22.2379 98.1270 261.3533 0.7010 119.9629 46.8536 27.9429 13.4277 5.5513 215.2473 38.5430 6.9104 12.8517 5.7486 6.5149 22.4452 28.5782 367.5421 254.8082 26.2485 19.7566 31.3315 44.0248 84.5962 21.9600 13.3288 233.3914 5.1344 611.1004 9.0139 28.6011 6.0933 149.1883 16.4202 248.4096 118.4187 272.3485 70.9186 131.1582 180.8809 348.5915 15.6503 21.2385 10.7790 29.4046 0.4257 16.9378 17.6120 15.6623 7.0491 19.9604 30.3418 9.0722 3.6006 13.7292 3.9447 37.3336 48.5039 21.4090
temp: 298.150 k
press: 1.00000 atm
elementType: 16 8 8 8 8 8 7 7 7 7 6 6 6 6 6 6 6 6 6 6 6 6 6 6 6 6 1 1 1 1 1 1 1 1 1 1 1 1 1 1 1 1 1 1
symmnumber: 1
zpe: 866017.4 jmol-1
zpe.correction: 0.329849 hartree
zpe.thermalcorrener: 0.355708 hartree
zpe.thermalcorrenthalpy: 0.356652 hartree
zpe.thermalcorrgfe: 0.269918 hartree
zpe.sumelectzpe: -1611.795169 hartree
zpe.sumelectthermal: -1611.769310 hartree
zpe.sumelectthermalent: -1611.768366 hartree
zpe.sumelectthermalfe: -1611.855100 hartree
dipole: 0.8844 -1.4793 -0.7794
dipole: 1.8916
quadrupole: -87.3220 -173.8144 -171.5268
quadrupole: 30.2562 -3.1346 -3.1998
quadrupole: 56.8991 -29.5933 -27.3057 30.2562 -3.1346 -3.1998
hfenergy: -1612.1250176 hartree
pointgroup: C01 [X(C16H18N4O5S1)]
dipole: 0.3565003 0.3482053 0.5527195 debye
polarizability: 351.3359221|6.3625938|220.7444489|0.7521756|33.8890483|174.6057975 unknown
InChI: InChI=1S/C16H18N4O5S/c1-7(21)18-9-5-4-8(6-17-9)12(22)19-10-13(23)20-11(15(24)25)16(2,3)26-14(10)20/h4-6,10-11,14,18-19,24H,1-3H3
charge 0 multiplicity 1
44 atoms
S  -2.241409 0.348593 1.742378
O  -2.558028 -0.270653 -2.594739
O  -6.78668 0.725241 0.398112
O  -5.718531 -1.055086 1.448049
O  0.685263 -3.037254 -1.142715
O  5.657852 2.460651 1.012273
N  -3.553933 -0.638364 -0.399072
N  -0.258133 -1.067429 -0.335953
N  3.68817 0.328073 0.679238
N  6.043762 0.245397 0.274923
C  -2.64772 -1.167559 0.646544
C  -3.584665 1.47431 0.861761
C  -4.437153 0.466627 -0.03597
C  -1.611108 -1.533977 -0.483737
C  -2.579129 -0.723465 -1.440044
C  -4.399524 2.183257 1.960176
C  -2.864461 2.489898 -0.051267
C  -5.672458 -0.067301 0.68801
C  0.832748 -1.872376 -0.655607
C  2.190353 -1.290723 -0.39889
C  3.311918 -1.922042 -1.001577
C  2.448858 -0.179183 0.443306
C  4.59726 -1.409303 -0.784956
C  4.74429 -0.264322 0.055324
C  6.441927 1.512694 0.772614
C  7.951916 1.606142 1.010525
H  -3.048749 -1.96659 1.281086
H  -4.759402 0.995929 -0.948333
H  -1.577172 -2.608631 -0.732901
H  -4.828758 1.465666 2.679429
H  -3.75311 2.879636 2.521777
H  -5.21976 2.769841 1.506075
H  -2.118879 3.065536 0.523453
H  -2.34368 1.997056 -0.89028
H  -3.5973 3.204245 -0.474623
H  -0.129337 -0.117998 0.023666
H  -7.582188 0.383772 0.891209
H  3.13993 -2.800957 -1.630363
H  1.646384 0.322852 0.999639
H  5.470225 -1.870763 -1.259955
H  6.80487 -0.376845 -0.005886
H  8.175511 1.311997 2.052798
H  8.266558 2.652663 0.880513
H  8.546374 0.962549 0.336893
