program: Gaussian 09
title: 000264082
version: EM64L-G09RevD.01
frameworkgroup: C1[X(C18H20N2O4)]
method: RPBEPBE
basis: SDD
operation: Freq
keyword: #p
keyword: freq=noraman
keyword: PBEPBE/SDD
title: #p freq=noraman PBEPBE/SDD
converged: YES YES NO NO
title: Mulliken charges:
elementType: O O O O N N C C C C C C C C C C C C C C C C C C H H H H H H H H H H H H H H H H H H H H
charge: -0.243736 -0.293481 -0.230418 -0.277174 -0.093963 -0.089437 0.462052 0.457575 0.226573 0.252523 0.205178 0.194114 -0.506366 -0.506531 -0.415078 -0.389008 -0.318371 -0.318727 -0.383991 -0.385038 -0.537779 -0.535495 -0.538178 -0.505228 0.244169 0.239103 0.269033 0.272837 0.243275 0.253557 0.236857 0.235419 0.221254 0.221024 0.247598 0.223295 0.243237 0.227969 0.222794 0.222799 0.248490 0.228450 0.253541 0.215285
chargesum: 0.00000
title: Mulliken charges with hydrogens summed into heavy atoms:
elementType: O O O O N N C C C C C C C C C C C C C C C C C C
charge: -0.243736 -0.293481 -0.230418 -0.277174 -0.093963 -0.089437 0.462052 0.457575 0.226573 0.252523 0.205178 0.194114 -0.262197 -0.267428 -0.146045 -0.116171 -0.075097 -0.065170 -0.147134 -0.149618 0.152097 0.159006 0.155905 0.192048
polarizability: 6.48428423e+02 1.22888113e+01 2.39538385e+02 -1.38208626e+00 1.36269849e+00 1.08559314e+02
1716.lowfreq: -0.0007 0.0006 0.0010 2.7249 3.1651 9.9880 17.4960 21.6611 27.2900
frequency: 17.4553 21.5990 27.2771 33.1284 61.0941 88.9022 90.1683 91.9681 101.0414 113.1512 134.1318 140.1776 157.4269 168.8165 185.2051 204.5713 213.2501 221.4051 229.8413 243.7807 260.4616 281.6344 296.6377 305.6017 318.2587 342.1478 358.5367 384.4495 402.1416 423.0058 459.2722 462.7346 467.6196 492.2256 507.2905 545.6524 589.5700 596.7077 613.0593 627.5956 642.7266 719.5336 730.7893 734.0308 744.3410 768.4112 788.9958 820.2104 842.4415 855.4152 859.7247 913.8060 932.8762 951.2854 962.0604 967.6615 971.1867 977.6308 980.6703 984.1935 999.3290 1003.0293 1106.2837 1109.9043 1111.0247 1112.3331 1113.1108 1124.8388 1145.6729 1150.0786 1153.5023 1157.5447 1166.4735 1185.3241 1221.4690 1225.7785 1259.0056 1263.5239 1282.9838 1290.3681 1306.1988 1353.1178 1376.4036 1381.7712 1403.5061 1415.9194 1434.1105 1437.3850 1441.7294 1443.8987 1454.5842 1466.6224 1467.0877 1468.7544 1469.6349 1470.7368 1471.5319 1474.0058 1499.6380 1504.6071 1511.3836 1567.6785 1580.3177 1597.5757 1606.4354 1608.1652 2957.1030 2961.3965 2961.6680 2986.7267 3016.7435 3021.1297 3044.4466 3050.3550 3050.9926 3096.5614 3123.6024 3126.1312 3128.9478 3130.4650 3145.0492 3147.5839 3151.5465 3154.9324 3172.4482 3176.2320
redmass: 4.4724 3.0867 5.1850 3.0541 4.0518 4.7598 3.5732 2.9473 3.1428 2.7547 4.7339 3.8925 3.0795 2.4659 3.5590 4.1332 2.0309 2.7930 1.2500 1.4455 1.5964 3.5955 2.5233 3.3841 4.5654 4.2541 4.1889 4.1608 5.5125 5.6740 5.2624 3.1517 3.5163 6.6793 5.8937 5.5215 4.1918 6.3143 3.9557 4.1025 6.1704 4.9603 5.1769 3.3815 2.9153 5.5244 5.6236 1.4619 1.4402 1.5250 1.6070 4.6292 4.1528 1.3457 7.7356 1.4131 8.8882 1.4923 8.7203 1.5366 4.5407 4.0125 1.9016 1.2636 1.2603 1.2580 1.2608 1.8917 1.5055 1.2998 1.4733 1.3886 1.7583 1.5830 1.9135 1.9955 2.0533 2.2318 2.0239 1.6969 1.9128 2.7984 3.5171 3.3189 3.7429 4.4106 1.2384 1.2029 1.3432 1.3151 1.0636 1.0499 1.0499 1.0499 1.0850 1.0517 1.0632 1.1002 3.0873 3.5639 3.3221 7.8099 7.3773 6.9172 6.3905 6.2631 1.0331 1.0327 1.0329 1.0328 1.0871 1.0883 1.1038 1.1041 1.1040 1.0989 1.0996 1.0990 1.0995 1.1055 1.0897 1.0901 1.0873 1.0879 1.0963 1.0972
irintensity: 1.1198 4.0093 0.3792 4.5065 1.5835 2.6790 10.2640 1.1690 4.6458 0.5887 0.3094 15.6395 4.2625 1.0143 18.5947 2.2340 0.0815 1.4036 0.7845 1.9500 0.2934 5.4613 1.0390 2.6220 1.0598 2.8484 1.2813 9.6496 34.0176 16.6364 4.0434 1.4411 1.6197 5.4797 7.4902 4.4036 15.8193 2.4642 28.5779 1.4532 18.8848 10.0909 14.6024 24.5263 1.6531 2.4031 30.8047 35.8404 13.7135 56.9258 3.7010 9.5583 0.1459 2.1866 81.3997 23.4791 3.2717 36.0728 54.9038 0.4570 106.4847 1.3753 102.5272 39.1536 0.1302 0.4202 0.1985 150.9554 10.8636 5.0215 22.7378 16.9269 48.1926 44.3631 72.0159 45.8098 668.1656 148.9184 279.1900 101.3556 55.2443 2.7963 18.2348 30.1154 68.7169 5.1688 3.9501 27.3578 9.9896 9.6723 22.5578 14.2394 11.8946 16.1457 190.1116 23.2844 56.1054 89.2977 199.5499 215.5354 56.5819 240.6614 23.5451 48.2432 173.1451 94.4787 69.1337 32.0236 113.3844 127.9500 48.4943 3.5175 46.4978 42.9923 50.2624 46.1156 31.1947 28.2289 29.6447 19.5819 8.7487 9.9005 9.5289 4.5560 10.4565 6.4047
temp: 298.150 k
press: 1.00000 atm
elementType: 8 8 8 8 7 7 6 6 6 6 6 6 6 6 6 6 6 6 6 6 6 6 6 6 1 1 1 1 1 1 1 1 1 1 1 1 1 1 1 1 1 1 1 1
symmnumber: 1
zpe: 905725.2 jmol-1
zpe.correction: 0.344973 hartree
zpe.thermalcorrener: 0.369412 hartree
zpe.thermalcorrenthalpy: 0.370356 hartree
zpe.thermalcorrgfe: 0.288270 hartree
zpe.sumelectzpe: -1106.443131 hartree
zpe.sumelectthermal: -1106.418692 hartree
zpe.sumelectthermalent: -1106.417748 hartree
zpe.sumelectthermalfe: -1106.499834 hartree
dipole: -0.4066 2.9250 0.9862
dipole: 3.1134
quadrupole: -112.6552 -110.9939 -146.1530
quadrupole: -11.7617 -7.6987 -0.8347
quadrupole: 10.6121 12.2735 -22.8856 -11.7617 -7.6987 -0.8347
hfenergy: -1106.788104 hartree
pointgroup: C01 [X(C18H20N2O4)]
dipole: 0.174982 -1.1502476 0.3830371 debye
polarizability: 647.7451717|12.3385891|239.5417593|-19.1447521|-1.9947984|109.2391906 unknown
InChI: InChI=1S/C18H20N2O4/c1-21-15-7-5-13(9-17(15)23-3)11-19-20-12-14-6-8-16(22-2)18(10-14)24-4/h5-12H,1-4H3
charge 0 multiplicity 1
44 atoms
O  -6.587274 1.605361 0.060048
O  6.440651 -1.374109 -0.544941
O  -7.180658 -0.97012 0.155039
O  6.978618 1.462218 -0.586282
N  -0.692716 -0.221532 -0.17953
N  0.557052 0.47124 -0.255708
C  -3.098132 0.156364 -0.07121
C  2.96223 0.0991 -0.361236
C  -5.496459 0.730035 0.029647
C  5.364928 -0.468438 -0.461431
C  -5.821224 -0.666599 0.080994
C  5.691688 0.92612 -0.480106
C  -4.147335 1.122873 -0.045335
C  4.012124 -0.861564 -0.388053
C  -3.431581 -1.221309 -0.020138
C  3.294369 1.48152 -0.41318
C  -4.778247 -1.624676 0.054995
C  4.639451 1.876043 -0.467566
C  -1.713137 0.619372 -0.149888
C  1.578232 -0.368133 -0.286602
C  -6.293845 3.039037 0.006427
C  6.120354 -2.802879 -0.56762
C  -7.553136 -2.386817 0.212574
C  8.114688 0.817183 0.103396
H  -3.885469 2.185498 -0.085486
H  3.749732 -1.924831 -0.365849
H  -2.622917 -1.957666 -0.040244
H  2.486711 2.218678 -0.398299
H  -5.016706 -2.691686 0.093702
H  4.924082 2.932394 -0.49755
H  -1.529642 1.709008 -0.184589
H  1.396844 -1.458304 -0.254199
H  -5.773347 3.309899 -0.933223
H  -5.684074 3.359152 0.874153
H  -7.276477 3.531422 0.041522
H  5.614184 -3.11873 0.365381
H  7.09125 -3.312904 -0.652905
H  5.487262 -3.057534 -1.43951
H  -7.133111 -2.876867 1.112312
H  -7.221642 -2.927097 -0.695272
H  -8.651304 -2.387581 0.266435
H  8.930344 1.55322 0.031945
H  8.392337 -0.128486 -0.386004
H  7.868506 0.626824 1.164685
