program: Gaussian 09
title: 000264067
version: EM64L-G09RevD.01
frameworkgroup: C1[X(C21H15NOS)]
method: RPBEPBE
basis: SDD
operation: Freq
keyword: #p
keyword: freq=noraman
keyword: PBEPBE/SDD
title: #p freq=noraman PBEPBE/SDD
converged: YES YES NO NO
title: Mulliken charges:
elementType: S O N C C C C C C C C C C C C C C C C C C C C C H H H H H H H H H H H H H H H
charge: 0.261692 -0.206280 -0.003962 0.331312 0.265119 0.457898 -0.073850 -0.603388 -0.371201 -0.388394 -0.366977 -0.324954 -0.245006 -0.246375 -0.262973 -0.233801 -0.775339 0.163931 0.290264 -0.337866 -0.342556 -0.242911 -0.229045 -0.223511 0.227060 0.249992 0.220926 0.253286 0.231744 0.234714 0.228717 0.300199 0.299939 0.231294 0.249249 0.279063 0.232114 0.235104 0.234772
chargesum: 0.00000
title: Mulliken charges with hydrogens summed into heavy atoms:
elementType: S O N C C C C C C C C C C C C C C C C C C C C C
charge: 0.261692 -0.206280 -0.003962 0.331312 0.265119 0.457898 -0.073850 -0.603388 -0.144141 -0.138402 -0.146051 -0.071667 -0.013262 -0.011662 -0.034256 -0.002507 -0.175202 0.163931 0.290264 -0.088617 -0.063493 -0.010797 0.006059 0.011260
polarizability: 3.74177018e+02 7.16331954e+00 3.40585807e+02 2.71702988e-01 2.47229420e-01 9.60550518e+01
1716.lowfreq: -4.1024 -3.2546 -0.0021 -0.0013 -0.0010 2.3512 16.7884 20.2308 35.6228
frequency: 16.7790 20.1942 35.6071 51.4885 76.3933 93.9582 100.3196 123.7903 130.5891 146.6733 159.4234 242.0917 244.8714 246.6586 302.6933 327.3110 363.0967 398.8083 411.3084 414.2531 419.0207 438.8763 455.2742 465.6424 521.1675 559.3870 560.4192 565.6844 584.0010 612.2809 613.0027 627.7775 636.0440 695.6627 700.0301 733.2450 741.1245 746.8891 764.0588 771.1349 777.2024 788.9540 800.2895 837.6676 858.1809 877.7477 887.1453 897.6122 942.5679 952.5010 957.3722 963.5434 989.6621 991.0296 991.9675 992.8661 995.9024 1000.9354 1011.4743 1028.5674 1034.0177 1044.8329 1086.4612 1099.3091 1131.6951 1139.0691 1170.7352 1173.6030 1182.7134 1188.1573 1196.1695 1207.9625 1247.0795 1273.0196 1288.8102 1302.3165 1309.1496 1320.3362 1376.0481 1388.5200 1393.8575 1402.0032 1418.9328 1436.7299 1437.0395 1449.4713 1476.7090 1478.6897 1515.8581 1556.5027 1569.2250 1576.2857 1597.7104 1612.4766 1615.6589 1620.6254 3025.8004 3087.6210 3129.5975 3129.9961 3132.5116 3138.7060 3140.5956 3143.6553 3149.8210 3154.6071 3158.4722 3159.5057 3169.0075 3170.1749 3170.6719
redmass: 6.3158 4.3261 6.0011 6.3705 5.1000 3.1103 4.1918 5.9273 5.2181 7.0628 4.0341 4.8670 5.0085 7.2143 5.4223 8.4331 14.0713 2.8082 6.4865 3.1911 3.2274 3.4187 6.9364 6.4798 3.3403 7.4333 3.3605 2.3508 8.5684 6.6986 6.6590 7.4147 4.2324 1.8421 6.0389 2.5831 6.4957 6.5454 1.6318 1.4894 1.5298 6.6904 2.2347 6.7251 1.2551 1.4141 2.1660 1.8338 7.6064 1.5275 1.4024 1.3778 6.2071 1.3350 1.3792 7.4527 1.3391 3.9989 1.3410 1.9555 1.9969 2.2075 1.5904 2.3549 1.1048 1.4849 1.1183 1.0766 1.1004 1.1476 1.9479 2.3796 1.5855 2.3949 2.1837 2.1734 2.5507 1.3691 3.7172 9.4125 7.7345 1.0963 2.9871 3.2202 2.2671 2.7819 2.7201 2.2186 4.0152 6.6350 7.4220 7.5064 6.9207 6.5003 6.0897 6.5173 1.0585 1.1024 1.0851 1.0851 1.0853 1.0880 1.0892 1.0893 1.0926 1.0950 1.0940 1.0961 1.1005 1.1014 1.1000
irintensity: 2.2939 0.0951 1.4996 0.5296 0.0470 6.1968 3.9343 0.0948 0.5408 1.4561 0.7415 0.2188 0.2071 14.5424 0.0084 0.6299 2.2357 0.0591 0.9630 0.9115 2.7288 2.9392 4.4192 0.0346 0.6736 3.7151 1.6822 7.6040 13.2106 4.5885 2.4173 40.2319 2.0981 47.4105 4.5314 43.7668 21.0339 8.2060 47.8570 139.9025 15.6244 0.3743 0.5507 3.2405 0.3018 0.4689 0.3468 3.1951 82.9822 0.6949 0.6998 2.3631 0.9652 0.2085 0.4336 1.4519 0.0001 59.4254 0.2416 1.2639 8.4223 5.8691 7.5233 0.9731 1.6975 9.3923 3.1770 10.8734 17.7861 55.9377 98.8051 19.9540 8.0896 26.4713 116.8902 82.7372 10.5433 32.0347 0.8543 2.0012 4.4498 45.8783 31.8774 1.0523 27.5729 24.2319 33.0543 0.2180 55.7576 51.7095 75.8919 29.3463 30.0345 11.1246 5.3396 3.4980 29.9678 1.0005 0.4198 0.6917 0.4558 5.2592 14.1519 3.6270 19.4360 0.9166 39.6416 16.7719 46.8120 27.3015 16.3045
temp: 298.150 k
press: 1.00000 atm
elementType: 16 8 7 6 6 6 6 6 6 6 6 6 6 6 6 6 6 6 6 6 6 6 6 6 1 1 1 1 1 1 1 1 1 1 1 1 1 1 1
symmnumber: 1
zpe: 777804.4 jmol-1
zpe.correction: 0.296250 hartree
zpe.thermalcorrener: 0.315764 hartree
zpe.thermalcorrenthalpy: 0.316708 hartree
zpe.thermalcorrgfe: 0.245386 hartree
zpe.sumelectzpe: -1335.664455 hartree
zpe.sumelectthermal: -1335.644941 hartree
zpe.sumelectthermalent: -1335.643997 hartree
zpe.sumelectthermalfe: -1335.715319 hartree
dipole: -0.9024 3.3453 -0.0433
dipole: 3.4652
quadrupole: -105.8865 -135.7140 -154.3561
quadrupole: 13.9769 0.0101 0.1162
quadrupole: 26.0990 -3.7284 -22.3706 13.9769 0.0101 0.1162
hfenergy: -1335.9607047 hartree
pointgroup: C01 [X(C21H15N1O1S1)]
dipole: -0.3098992 -1.273313 0.3757873 debye
polarizability: 374.4981185|-7.3595626|323.0370219|-4.0898443|-62.2899888|113.2827366 unknown
InChI: InChI=1S/C21H15NOS/c23-20(15-8-2-1-3-9-15)14-24-21-18-12-5-4-10-16(18)17-11-6-7-13-19(17)22-21/h1-13H,14H2
charge 0 multiplicity 1
39 atoms
S  0.399068 1.811755 -0.701796
O  3.222895 2.496146 -0.937571
N  -0.740106 -0.58084 -0.013648
C  -3.460942 0.347685 -0.186307
C  -3.18113 -1.040485 0.187368
C  -2.353044 1.226963 -0.462526
C  -1.80347 -1.452718 0.258763
C  -1.003394 0.674764 -0.351266
C  -4.783046 0.875083 -0.29008
C  -2.597633 2.583546 -0.828175
C  -4.189713 -2.003196 0.484032
C  -1.477609 -2.792599 0.618238
C  -5.004686 2.211021 -0.650772
C  -3.906277 3.073836 -0.922443
C  -3.854277 -3.319097 0.836944
C  -2.489234 -3.718724 0.905075
C  1.797243 0.594516 -0.39455
C  3.143987 1.279163 -0.600537
C  4.378203 0.448725 -0.386333
C  4.325603 -0.922537 -0.015098
C  5.643507 1.072536 -0.56441
C  5.51766 -1.653288 0.174136
C  6.832119 0.341658 -0.374455
C  6.771966 -1.024132 -0.004422
H  -5.643794 0.231166 -0.085735
H  -1.752214 3.24785 -1.036872
H  -5.246948 -1.722372 0.439245
H  -0.418172 -3.063809 0.660251
H  -6.028692 2.593319 -0.723868
H  -4.084217 4.116937 -1.203849
H  -4.646313 -4.041885 1.060891
H  1.69363 0.201558 0.631206
H  1.666583 -0.261839 -1.077854
H  -2.2331 -4.747364 1.181023
H  3.362594 -1.424387 0.127293
H  5.660445 2.129341 -0.851004
H  5.471287 -2.709638 0.460163
H  7.803077 0.829392 -0.51289
H  7.696148 -1.593849 0.143734
