program: Gaussian 09
title: 000264065
version: EM64L-G09RevD.01
frameworkgroup: C1[X(C17H13NOS)]
method: RPBEPBE
basis: SDD
operation: Freq
keyword: #p
keyword: freq=noraman
keyword: PBEPBE/SDD
title: #p freq=noraman PBEPBE/SDD
converged: YES YES NO NO
title: Mulliken charges:
elementType: S O N C C C C C C C C C C C C C C C C C H H H H H H H H H H H H H
charge: 0.248829 -0.195074 -0.019771 0.397018 -0.056531 -0.304027 -0.288545 -0.837382 -0.386985 -0.160118 0.292599 -0.327509 0.208599 -0.251071 -0.216056 -0.333736 -0.342512 -0.243286 -0.225310 -0.222294 0.245772 0.321482 0.272707 0.234501 0.246126 0.256290 0.230839 0.231910 0.246283 0.278262 0.231132 0.234063 0.233794
chargesum: 0.00000
title: Mulliken charges with hydrogens summed into heavy atoms:
elementType: S O N C C C C C C C C C C C C C C C C C
charge: 0.248829 -0.195074 -0.019771 0.397018 -0.056531 -0.304027 -0.042773 -0.243193 -0.152484 0.086007 0.292599 -0.071219 0.208599 -0.020233 0.015854 -0.087453 -0.064250 -0.012154 0.008753 0.011500
polarizability: 2.95097831e+02 3.45099334e+00 2.28194874e+02 1.70340116e+01 -1.13482011e+01 1.33090399e+02
1716.lowfreq: -9.9270 -7.8754 -0.0006 0.0007 0.0012 2.0473 7.4381 13.2185 32.3643
frequency: -5.9185 12.3897 32.3169 46.4374 87.5505 130.9413 139.3840 160.3391 175.7335 204.0780 264.6465 280.6952 325.9225 347.9274 395.8983 398.3900 409.0079 432.9315 459.5837 478.3325 515.6874 526.3801 560.7079 590.1049 612.1022 621.9731 632.7962 660.8942 696.9633 737.3343 755.4429 757.7138 761.2649 770.9581 789.6969 827.6694 843.5937 858.7254 882.4605 896.5249 921.7206 952.4858 958.7705 978.8365 988.4306 989.8214 991.1604 993.7577 1010.9056 1019.0815 1027.1351 1085.5877 1086.5935 1132.0354 1147.5589 1168.7739 1172.9174 1187.6326 1190.0989 1217.0444 1236.7582 1255.2600 1276.4409 1293.6692 1320.1594 1366.3421 1386.6532 1391.9899 1404.9153 1415.8921 1435.6207 1450.2872 1477.0296 1498.7126 1549.5310 1577.1335 1589.4091 1601.3597 1616.1660 1623.6365 2945.0178 3083.9171 3122.3143 3128.7001 3133.4721 3136.6943 3138.6245 3149.9514 3155.4944 3159.5820 3165.3497 3169.5917 3169.7108
redmass: 5.5129 6.5528 4.4825 5.4893 5.6836 6.0641 4.5071 4.0201 4.1005 4.9478 5.2717 6.1835 4.7050 10.5629 3.4800 2.8516 3.4396 5.0153 5.9837 3.0445 7.1129 3.5017 2.8345 7.5988 6.4777 7.5085 7.4941 3.9512 1.8322 6.3889 5.4773 1.4024 2.0331 3.3655 3.1091 1.3855 5.8407 1.2581 1.6654 2.0251 5.1390 1.5682 1.3477 1.3755 4.1199 6.0960 1.4380 1.3325 1.3440 2.1875 2.0186 1.6375 2.7003 2.0701 1.2038 1.1057 1.0780 1.1882 1.2361 1.6196 2.0381 1.7589 1.7826 2.3265 1.3381 4.2721 8.9567 1.1133 4.3398 2.2531 2.2446 2.9217 2.1953 3.6463 7.4665 6.5904 6.3042 6.6487 7.4899 6.6861 1.0668 1.0931 1.0874 1.0851 1.0892 1.0888 1.0881 1.0925 1.0947 1.0960 1.0976 1.1000 1.1010
irintensity: 1.5433 1.1029 1.3611 1.4267 0.4651 0.2962 4.9716 7.4940 6.0065 1.2920 3.9293 17.6043 9.4652 9.2102 0.7475 0.1120 1.6005 1.3378 3.7591 11.6269 0.0235 0.1906 0.4999 18.7523 0.0879 1.6029 30.3797 0.0860 45.3540 29.0298 2.6909 30.8094 65.8417 15.3994 13.2097 75.4833 15.0123 0.4621 2.3796 7.1132 15.6776 0.3661 1.6835 2.9088 44.7139 15.9420 4.5544 0.0229 0.3196 4.8004 0.6565 13.5766 63.2739 86.5087 6.8353 1.0716 9.2835 79.7309 27.6654 56.5671 8.5910 5.7855 92.2926 16.5035 13.1040 51.7637 1.2284 23.8354 0.6211 28.3987 21.3532 20.0047 0.5029 37.0018 64.8340 46.0416 98.9473 41.0027 28.9490 38.2292 144.4120 2.1892 4.9331 0.2840 6.2987 11.3333 6.8786 20.7127 25.9549 19.6665 11.2548 18.6841 25.4235
temp: 298.150 k
press: 1.00000 atm
elementType: 16 8 7 6 6 6 6 6 6 6 6 6 6 6 6 6 6 6 6 6 1 1 1 1 1 1 1 1 1 1 1 1 1
symmnumber: 1
zpe: 656314.6 jmol-1
zpe.correction: 0.249977 hartree
zpe.thermalcorrener: 0.265750 hartree
zpe.thermalcorrenthalpy: 0.266694 hartree
zpe.thermalcorrgfe: 0.204344 hartree
zpe.sumelectzpe: -1182.275913 hartree
zpe.sumelectthermal: -1182.260141 hartree
zpe.sumelectthermalent: -1182.259197 hartree
zpe.sumelectthermalfe: -1182.321547 hartree
dipole: 0.4817 2.5320 -1.8127
dipole: 3.1510
quadrupole: -90.5576 -117.5970 -125.3800
quadrupole: -8.7698 6.8606 0.1926
quadrupole: 20.6206 -6.4188 -14.2018 -8.7698 6.8606 0.1926
hfenergy: -1182.5258905 hartree
pointgroup: C01 [X(C17H13N1O1S1)]
dipole: 0.1599732 0.7933708 -0.9390669 debye
polarizability: 296.6009795|3.5559863|217.2834167|6.563106|-32.6254266|142.4987069 unknown
InChI: InChI=1S/C17H13NOS/c19-16(14-7-2-1-3-8-14)12-20-17-11-10-13-6-4-5-9-15(13)18-17/h1-11H,12H2
charge 0 multiplicity 1
33 atoms
S  0.003007 -2.65589 0.081407
O  -1.79852 -1.056276 1.959155
N  1.410799 -0.329981 -0.362382
C  3.84057 -0.071307 0.04895
C  2.559667 0.451683 -0.378821
C  1.497788 -1.592446 0.063347
C  3.882016 -1.436434 0.497112
C  -1.286404 -1.39392 -0.414705
C  4.991067 0.776366 0.010613
C  2.721467 -2.202659 0.509926
C  -3.295498 0.020863 0.407079
C  2.472978 1.805032 -0.829324
C  -2.10553 -0.835543 0.756399
C  4.882357 2.097614 -0.435723
C  3.615853 2.611845 -0.857012
C  -3.609546 0.402047 -0.926037
C  -4.128212 0.468746 1.469317
C  -4.73436 1.213384 -1.188859
C  -5.252725 1.274474 1.20528
C  -5.559413 1.648669 -0.125863
H  4.832793 -1.866274 0.832799
H  -0.709165 -0.567887 -0.88276
H  -1.930627 -1.866495 -1.173552
H  5.959497 0.377265 0.336061
H  2.722334 -3.24081 0.854761
H  1.494831 2.181686 -1.143884
H  5.765691 2.744578 -0.463469
H  3.543148 3.649008 -1.202576
H  -2.977555 0.080724 -1.760531
H  -3.865592 0.169785 2.489551
H  -4.967842 1.506759 -2.218168
H  -5.889981 1.612453 2.029708
H  -6.433794 2.276041 -0.332399
