program: Gaussian 09
title: 000264062
version: EM64L-G09RevD.01
frameworkgroup: C1[X(C16H21NO2S)]
method: RPBEPBE
basis: SDD
operation: Freq
keyword: #p
keyword: freq=noraman
keyword: PBEPBE/SDD
title: #p freq=noraman PBEPBE/SDD
converged: YES YES NO NO
title: Mulliken charges:
elementType: S O O N C C C C C C C C C C C C C C C C H H H H H H H H H H H H H H H H H H H H H
charge: 0.223807 -0.281299 -0.246507 -0.007882 0.055084 0.240574 -0.756903 0.397288 -0.066684 -0.335264 -0.320057 -0.372375 -0.813913 -0.333242 -0.205887 -0.219698 -0.260673 -0.221474 -0.682026 -0.686265 0.253916 0.279507 0.309992 0.245467 0.240082 0.237567 0.235578 0.237800 0.258970 0.194699 0.214703 0.201236 0.214969 0.228132 0.231320 0.204208 0.224275 0.227064 0.201799 0.221184 0.230928
chargesum: 0.00000
title: Mulliken charges with hydrogens summed into heavy atoms:
elementType: S O O N C C C C C C C C C C C C C C C C
charge: 0.223807 -0.281299 -0.246507 -0.007882 0.309000 0.240574 -0.167403 0.397288 -0.066684 -0.335264 -0.074590 -0.132292 -0.102968 -0.074272 0.203514 0.196507 -0.032541 0.009845 -0.026479 -0.032354
polarizability: 2.86015539e+02 -2.50561099e+01 2.43451346e+02 -2.72988410e+01 4.69839088e+00 1.24025808e+02
1716.lowfreq: -2.7187 -0.0019 -0.0016 -0.0009 4.7596 8.1549 18.6574 25.4230 26.3592
frequency: 18.5209 25.3378 26.3375 45.4797 65.3512 85.4167 87.9064 98.9744 126.2121 146.3986 156.0326 167.1346 171.6187 206.8577 225.1706 232.4521 246.7748 265.7278 283.4685 290.9853 322.6594 349.1754 353.0128 397.0665 421.2435 496.0898 505.7164 519.6291 524.0747 541.0694 563.1744 589.4922 609.9284 658.8240 706.3493 717.6267 758.8039 770.0202 786.4062 811.9545 820.6204 837.9981 844.1804 865.9584 871.8138 879.5943 881.6303 945.2411 961.3819 982.0904 993.4293 997.6891 1022.8484 1032.1974 1045.1600 1048.4945 1067.3027 1078.4399 1093.2248 1111.2101 1123.0190 1137.0820 1139.9887 1150.5834 1172.5472 1205.7812 1246.8160 1248.7956 1257.4538 1260.0478 1274.5736 1295.5858 1312.3986 1343.8364 1350.4466 1366.2057 1374.2767 1393.6315 1393.7595 1395.3144 1402.4430 1412.9407 1415.4338 1448.3193 1459.2106 1459.8258 1468.2185 1474.6567 1478.7163 1481.7405 1492.2183 1494.7714 1506.4847 1545.1809 1592.8858 1619.2284 2949.5955 2955.6729 2979.0844 2990.8827 2991.6242 3016.4271 3018.8806 3030.7125 3054.8379 3056.0951 3087.8151 3088.6512 3095.0977 3098.1565 3098.9127 3129.4766 3132.6190 3141.4866 3144.8519 3157.1924 3169.7592
redmass: 4.3635 4.2340 4.2402 2.8035 2.2665 2.5797 2.5504 3.6306 3.9369 3.6592 1.1970 3.4934 3.3333 2.8671 3.1654 1.1826 1.3888 3.0951 3.0339 5.3215 5.0446 3.6301 7.7501 3.4981 3.1269 4.8269 4.9250 5.1158 3.3442 3.8712 3.8322 7.2938 3.5249 4.0470 5.6400 5.1282 3.2225 1.3120 3.2899 1.0947 1.1051 3.8156 3.4692 2.7236 1.4335 7.9242 1.5049 4.8271 1.3653 1.9555 1.3236 2.1424 2.4205 2.9499 1.5703 3.0849 2.5006 3.5371 2.3175 2.0781 2.1637 1.4463 1.4883 1.4234 1.1385 1.3164 1.2282 1.5710 1.1797 1.1671 2.1266 4.7085 1.2444 2.6962 1.2877 1.2655 1.2762 1.2633 2.0568 1.2853 1.8195 1.8469 1.4603 2.7563 1.0408 1.0408 1.0457 1.1307 1.0510 1.0456 1.0827 1.0833 4.1726 6.7258 6.2817 6.4645 1.0603 1.0573 1.0378 1.0359 1.0359 1.1027 1.1035 1.0866 1.0580 1.0971 1.0989 1.0988 1.0985 1.1011 1.1011 1.0850 1.1058 1.0893 1.0926 1.0953 1.1000
irintensity: 0.0512 1.0450 0.2597 0.2327 0.8243 2.0250 0.7827 1.1662 1.3723 3.6760 0.1605 6.6992 2.6581 2.5323 0.3501 0.1058 3.0129 1.2821 3.2555 0.1097 0.9957 12.2641 8.5876 9.3746 5.6237 2.4485 4.7467 0.7215 0.8911 12.4010 0.8176 9.0096 2.7056 0.0089 18.3424 5.7543 7.2859 87.0143 0.2809 2.6485 5.0860 5.9567 5.5720 24.2090 18.6434 50.2681 4.3235 202.3121 2.3275 3.9601 0.4427 30.4461 6.1106 87.9190 6.0138 89.7406 0.2922 137.2628 42.7378 3.3540 43.5256 8.6686 1.9043 41.8479 3.2355 5.4207 2.8697 2.7878 18.5426 5.3206 5.6081 54.1107 18.9212 18.3372 4.8128 0.9957 2.2148 19.0941 10.0615 21.4525 19.0993 35.6642 20.2852 1.9911 9.5117 10.4383 15.3993 45.6563 8.1593 1.6098 9.5642 2.2282 9.5910 88.2295 143.5833 19.7724 46.8114 43.2868 24.2409 30.8293 29.6569 17.7180 46.6099 17.4573 15.4830 15.1841 31.3780 40.2141 17.8670 34.8065 45.3117 0.2914 1.3849 8.4190 7.6915 29.0813 23.9371
temp: 298.150 k
press: 1.00000 atm
elementType: 16 8 8 7 6 6 6 6 6 6 6 6 6 6 6 6 6 6 6 6 1 1 1 1 1 1 1 1 1 1 1 1 1 1 1 1 1 1 1 1 1
symmnumber: 1
zpe: 881272.3 jmol-1
zpe.correction: 0.335659 hartree
zpe.thermalcorrener: 0.356865 hartree
zpe.thermalcorrenthalpy: 0.357810 hartree
zpe.thermalcorrgfe: 0.283066 hartree
zpe.sumelectzpe: -1224.052033 hartree
zpe.sumelectthermal: -1224.030827 hartree
zpe.sumelectthermalent: -1224.029882 hartree
zpe.sumelectthermalfe: -1224.104626 hartree
dipole: -1.7849 0.2223 0.7317
dipole: 1.9418
quadrupole: -103.0437 -115.0320 -132.8678
quadrupole: 3.0022 -3.5030 1.9767
quadrupole: 13.9374 1.9491 -15.8866 3.0022 -3.5030 1.9767
hfenergy: -1224.3876921 hartree
pointgroup: C01 [X(C16H21N1O2S1)]
dipole: -0.6720033 -0.0412434 0.3610242 debye
polarizability: 282.9789376|-12.9618648|235.3101137|-47.3788006|18.6090455|135.2036413 unknown
InChI: InChI=1S/C16H21NO2S/c1-4-18-16(19-5-2)11-20-15-10-12(3)13-8-6-7-9-14(13)17-15/h6-10,16H,4-5,11H2,1-3H3
charge 0 multiplicity 1
41 atoms
S  0.957854 -1.785972 -1.530262
O  3.183195 1.595125 -0.863998
O  3.327646 -0.529289 0.279834
N  -0.859023 0.052349 -0.585031
C  2.461141 0.397601 -0.432968
C  -3.112292 -0.557213 0.278539
C  1.826595 -0.13072 -1.728898
C  -2.824368 -1.957236 0.032409
C  -2.090837 0.415985 -0.049011
C  -0.633724 -1.246593 -0.803246
C  -1.581401 -2.285332 -0.508913
C  -4.350072 -0.095435 0.826913
C  -3.841275 -3.033296 0.351388
C  -2.341665 1.804149 0.181495
C  3.592251 2.463684 0.263247
C  4.416312 -1.128464 -0.524703
C  -4.574219 1.269127 1.04358
C  -3.563127 2.224381 0.718149
C  4.425482 3.60373 -0.319394
C  5.381388 -1.790451 0.458381
H  1.683657 0.648644 0.312893
H  2.584051 -0.285387 -2.513558
H  1.072173 0.592987 -2.071853
H  -1.319113 -3.328561 -0.712771
H  -5.132004 -0.819489 1.079661
H  -4.776422 -2.885205 -0.220909
H  -3.448678 -4.033919 0.106981
H  -4.111745 -3.026152 1.424046
H  -1.551005 2.514546 -0.079001
H  2.681435 2.848046 0.770909
H  4.17147 1.864892 0.993645
H  3.990169 -1.88145 -1.219958
H  4.917047 -0.336277 -1.116502
H  -5.527044 1.609378 1.463575
H  -3.74849 3.290417 0.8903
H  4.744104 4.295484 0.481945
H  5.326603 3.208611 -0.819825
H  3.840546 4.173663 -1.062022
H  6.204435 -2.289549 -0.085709
H  5.81611 -1.041405 1.142993
H  4.853443 -2.546304 1.065154
