program: Gaussian 09
title: 000264056
version: EM64L-G09RevD.01
frameworkgroup: C1[X(C13H18N2O2S)]
method: RPBEPBE
basis: SDD
operation: Freq
keyword: #p
keyword: freq=noraman
keyword: PBEPBE/SDD
title: #p freq=noraman PBEPBE/SDD
converged: YES YES NO NO
title: Mulliken charges:
elementType: S O O N N C C C C C C C C C C C C C H H H H H H H H H H H H H H H H H H
charge: 0.251891 -0.282818 -0.245765 -0.419758 -0.048197 0.050345 -0.743004 0.279007 -0.178717 0.023035 -0.205343 -0.221371 -0.357738 -0.342604 -0.215360 -0.228723 -0.681565 -0.684502 0.269857 0.279118 0.318108 0.316009 0.200163 0.213069 0.197048 0.217492 0.233476 0.244685 0.224212 0.224728 0.205536 0.223857 0.228434 0.202292 0.222932 0.230170
chargesum: 0.00000
title: Mulliken charges with hydrogens summed into heavy atoms:
elementType: S O O N N C C C C C C C C C C C C C
charge: 0.251891 -0.282818 -0.245765 -0.103749 -0.048197 0.320202 -0.145778 0.279007 -0.178717 0.023035 0.207889 0.193170 -0.124262 -0.097920 0.008853 -0.003995 -0.023738 -0.029107
polarizability: 2.51866241e+02 -1.67742372e+01 1.89144405e+02 -2.61464069e+01 4.23492169e+00 1.11972251e+02
1716.lowfreq: -8.3685 -3.0779 0.0004 0.0006 0.0008 7.4345 15.3291 25.1732 32.2307
frequency: 14.7142 25.1204 32.2270 44.4269 59.6097 79.0561 88.8526 107.4723 128.3677 169.7627 179.0151 220.5311 237.2567 246.8817 248.7585 280.5392 298.2133 320.1360 347.0551 379.6835 394.7132 425.8448 487.6303 542.1844 565.7718 578.5509 582.2359 610.7250 613.4927 649.1617 695.8836 751.0550 758.3411 765.2334 794.2057 811.9410 821.3243 841.3856 854.3239 865.8156 877.2051 931.7440 932.3840 949.9900 974.0599 1001.3265 1007.7178 1031.4844 1048.3699 1076.8661 1106.9026 1111.3673 1122.3440 1135.5730 1138.8626 1154.3311 1163.4479 1199.2659 1208.6051 1247.9359 1255.0776 1258.0460 1260.0829 1278.2607 1314.3473 1340.7106 1350.0931 1363.7934 1376.0245 1394.1855 1396.2345 1413.4817 1414.4995 1426.8826 1459.9673 1460.2554 1460.5814 1477.5134 1478.3176 1481.3465 1490.4422 1492.9594 1595.2929 1631.2349 2953.0754 2955.6076 2991.0099 2992.3591 3017.1062 3019.5953 3040.9603 3059.4611 3088.1153 3089.3892 3098.8832 3099.8430 3131.2847 3140.5127 3143.4146 3158.8191 3172.0553 3598.5891
redmass: 4.4230 4.5802 4.3255 2.5820 2.1996 1.9092 4.0177 5.6115 4.2048 3.4725 4.8197 3.1482 1.1573 4.4008 1.3117 3.0724 6.1223 5.3023 3.6356 6.5119 4.0224 2.9715 4.7432 3.7335 1.2549 3.8833 7.5900 3.6262 5.7349 5.6609 5.8410 1.3602 3.1586 3.4772 5.1494 1.1039 1.1153 2.5946 1.4805 2.7363 5.8499 8.8187 1.3830 4.8228 1.3027 2.1080 2.0602 2.9755 3.0658 3.6437 1.7068 2.0699 2.1414 1.4590 1.4775 1.6583 1.2730 1.4547 2.3830 1.1594 1.1896 1.2662 2.4467 2.0244 1.2353 2.9294 1.2446 1.2664 1.2730 1.2553 1.2905 2.7010 2.2695 1.4358 4.1984 1.0408 1.0426 1.9345 1.2582 1.0472 1.0813 1.0827 6.8549 7.4828 1.0581 1.0585 1.0359 1.0360 1.1036 1.1043 1.0863 1.0586 1.0989 1.0988 1.1012 1.1012 1.0853 1.1064 1.0904 1.0957 1.0994 1.0814
irintensity: 0.1622 3.4483 1.1766 0.0489 1.1233 2.1641 2.1034 0.7642 2.1199 8.1511 2.2918 0.4956 0.0718 6.9194 2.8021 2.5873 0.7636 1.2216 11.5733 12.5742 5.8226 10.4209 1.1109 24.6020 78.0965 0.5399 2.4010 2.0543 0.4776 9.2339 33.6587 106.9578 8.3891 9.5416 1.3643 2.4266 5.5395 8.4926 0.0688 18.8138 6.2507 6.9817 4.0644 214.1440 0.0408 21.8879 8.5218 100.1615 91.2203 127.9608 3.0235 3.5954 46.7479 9.3989 0.4122 9.5177 15.2595 11.0113 6.0500 1.7903 9.4455 8.6431 66.3077 9.9964 14.9609 77.1735 2.7799 0.5502 2.5411 20.8058 25.1526 38.2324 137.6586 114.4267 13.7958 9.1979 10.3774 13.1065 21.8662 1.9057 9.1042 2.9395 1.5526 3.1538 47.7217 42.8080 29.4961 27.9913 19.1608 43.6492 9.1888 12.3378 32.7550 37.1809 36.2020 43.4710 0.1779 0.9804 12.3471 26.8220 19.6751 50.8950
temp: 298.150 k
press: 1.00000 atm
elementType: 16 8 8 7 7 6 6 6 6 6 6 6 6 6 6 6 6 6 1 1 1 1 1 1 1 1 1 1 1 1 1 1 1 1 1 1
symmnumber: 1
zpe: 765352.8 jmol-1
zpe.correction: 0.291507 hartree
zpe.thermalcorrener: 0.310368 hartree
zpe.thermalcorrenthalpy: 0.311313 hartree
zpe.thermalcorrgfe: 0.241071 hartree
zpe.sumelectzpe: -1162.816694 hartree
zpe.sumelectthermal: -1162.797833 hartree
zpe.sumelectthermalent: -1162.796889 hartree
zpe.sumelectthermalfe: -1162.867130 hartree
dipole: -0.0531 -1.4732 0.3962
dipole: 1.5265
quadrupole: -98.2364 -101.0242 -120.5700
quadrupole: 5.7302 -2.4660 2.5599
quadrupole: 8.3738 5.5860 -13.9598 5.7302 -2.4660 2.5599
hfenergy: -1163.1082018 hartree
pointgroup: C01 [X(C13H18N2O2S1)]
dipole: 0.0550989 0.572432 0.1730683 debye
polarizability: 246.9367754|-13.275901|165.8800971|40.6815653|30.9266223|140.1660242 unknown
InChI: InChI=1S/C13H18N2O2S/c1-3-16-12(17-4-2)9-18-13-14-10-7-5-6-8-11(10)15-13/h5-8,12,14H,3-4,9H2,1-2H3
charge 0 multiplicity 1
36 atoms
S  0.570112 1.089602 2.075918
O  2.948369 -1.674068 0.196653
O  2.900669 0.720668 -0.139924
N  -1.972237 1.683315 1.09524
N  -1.161535 -0.328503 0.371571
C  2.134568 -0.460691 0.224902
C  1.540302 -0.469591 1.64327
C  -2.981775 1.142884 0.275937
C  -0.918102 0.761277 1.112244
C  -2.455714 -0.118858 -0.168586
C  3.31163 -2.099912 -1.175427
C  4.013614 1.06576 0.773915
C  -4.252499 1.612131 -0.107959
C  -3.223386 -0.938848 -1.024289
C  -5.004728 0.77697 -0.965062
C  -4.498866 -0.476249 -1.414866
C  4.193027 -3.340665 -1.04796
C  4.880227 2.093785 0.047188
H  1.332194 -0.497071 -0.534689
H  2.327111 -0.537174 2.411362
H  0.848357 -1.318816 1.7373
H  -1.994155 2.578618 1.580012
H  2.381264 -2.321297 -1.740331
H  3.841455 -1.271363 -1.685773
H  3.602769 1.494828 1.711937
H  4.587772 0.150082 1.018729
H  -4.649333 2.57401 0.233114
H  -2.831885 -1.901544 -1.36666
H  -5.999307 1.101406 -1.290106
H  -5.115506 -1.092651 -2.078003
H  4.487545 -3.706083 -2.048852
H  5.108847 -3.109756 -0.476464
H  3.653624 -4.149022 -0.524782
H  5.716635 2.419482 0.692855
H  5.298237 1.663765 -0.879568
H  4.281199 2.980176 -0.224247
