program: Gaussian 09
title: 000264055
version: EM64L-G09RevD.01
frameworkgroup: C1[X(C13H17NO3S)]
method: RPBEPBE
basis: SDD
operation: Freq
keyword: #p
keyword: freq=noraman
keyword: PBEPBE/SDD
title: #p freq=noraman PBEPBE/SDD
converged: YES YES NO NO
title: Mulliken charges:
elementType: S O O O N C C C C C C C C C C C C C H H H H H H H H H H H H H H H H H
charge: 0.951754 -0.567536 -0.500654 -0.505609 -0.113130 -0.044625 -0.412003 -0.580444 -0.355968 -0.420248 -0.478498 -0.401516 0.316227 0.314289 -0.238545 -0.391971 -0.289233 -0.235254 0.208643 0.196981 0.199338 0.241500 0.216976 0.217321 0.175736 0.195192 0.216856 0.236003 0.274564 0.207273 0.198325 0.244751 0.298768 0.245068 0.379669
chargesum: 0.00000
title: Mulliken charges with hydrogens summed into heavy atoms:
elementType: S O O O N C C C C C C C C C C C C C
charge: 0.951754 -0.187867 -0.500654 -0.505609 -0.113130 0.164018 -0.015684 -0.121968 0.037089 -0.008199 0.032068 0.004082 0.316227 0.314289 -0.238545 -0.147220 0.009535 0.009815
polarizability: 2.24367008e+02 1.43453071e+00 1.95827616e+02 2.44766853e-01 1.31526575e+00 1.15665586e+02
1716.lowfreq: -11.0793 -1.6602 -0.0024 -0.0011 0.0005 7.6249 39.9109 52.7527 62.1230
frequency: 39.7775 52.6776 62.1010 101.4139 113.4327 160.4087 167.3610 173.2633 203.9397 225.1532 231.9413 261.4297 272.7605 280.5974 309.4617 323.0695 330.0122 350.3666 406.5230 427.6558 447.9155 451.6586 473.1005 497.0861 528.8824 555.8689 559.4157 618.6951 640.4162 698.8380 720.7578 783.2776 792.3334 821.7462 829.0297 850.2769 866.4344 875.7866 916.5609 933.9998 953.7421 958.5630 972.3954 983.8628 992.1298 1044.1152 1047.2290 1063.9450 1075.3873 1086.5058 1108.9045 1121.0652 1127.0532 1137.4098 1175.1971 1185.1917 1205.7463 1209.0199 1221.9346 1237.7891 1254.2204 1271.1967 1285.3670 1290.7143 1331.8184 1338.3685 1341.4509 1342.7720 1348.3325 1362.6387 1376.4075 1398.5301 1428.3073 1434.4060 1446.7025 1452.3136 1461.4526 1467.2171 1470.4308 1477.4848 1565.3941 1610.1294 2809.4062 2829.3489 2844.6220 2970.7977 2971.9931 2975.4256 2988.6109 3020.0078 3021.4870 3028.7941 3035.4678 3040.7900 3055.0741 3127.8185 3154.5713 3172.0539 3481.4793
redmass: 6.0568 3.4022 4.2432 6.7849 4.3646 2.8381 2.5312 2.2007 2.5101 3.7629 4.5437 3.1344 3.4216 2.6503 4.5683 1.9957 7.1098 4.4358 6.1265 8.7840 2.7943 3.0207 2.6647 4.2647 4.2571 5.7477 2.8049 3.8713 4.5462 3.1449 3.3929 4.5566 1.3327 1.5012 9.2334 5.8521 1.7066 2.1104 1.8709 1.5442 2.3228 7.2537 1.9599 1.7278 1.4043 1.2359 2.0614 2.2396 2.0382 2.1212 2.1251 2.1901 2.5977 2.3936 1.3650 1.4670 1.3588 1.9685 1.4825 1.6286 1.2720 1.2291 1.3502 1.3987 1.4252 1.4308 1.4558 1.4290 1.4961 1.6612 3.2208 1.7068 2.0442 1.1715 1.2201 1.1141 1.0956 1.4170 1.4355 1.1827 6.4180 7.4248 1.0800 1.0717 1.0700 1.0601 1.0625 1.0609 1.0620 1.0874 1.0861 1.0996 1.0973 1.1008 1.1037 1.0892 1.0902 1.0990 1.0661
irintensity: 0.4343 0.3683 0.2694 0.9409 1.2570 0.1734 33.7174 0.7407 18.1761 20.2657 3.3266 6.9888 20.6003 6.7911 37.5852 9.1019 8.4174 4.0794 10.6128 48.6376 0.9999 3.8683 2.4408 28.0448 34.5442 62.5243 24.0965 1.4787 5.8634 12.2459 14.7230 3.5534 44.5744 3.4350 62.9145 1.9308 7.0025 1.2960 3.8823 3.2463 20.0046 86.1097 6.0454 4.5518 1.7420 46.8754 41.4489 15.6471 7.5078 6.0670 8.8830 24.0115 15.0299 8.8367 4.3962 3.7838 2.8589 17.4846 2.3697 1.3830 5.6434 4.8518 9.0047 1.6543 1.6932 9.9299 0.6005 6.7341 2.0163 6.3557 26.4064 8.0325 5.7630 7.9762 15.2051 6.8080 16.8933 3.0659 25.0807 6.3109 7.5885 2.2790 45.6627 90.1690 65.7411 27.6219 12.6531 49.7526 28.2641 16.0779 35.9744 5.4990 49.9306 60.2896 67.8738 10.0226 8.3862 13.3377 41.0310
temp: 298.150 k
press: 1.00000 atm
elementType: 16 8 8 8 7 6 6 6 6 6 6 6 6 6 6 6 6 6 1 1 1 1 1 1 1 1 1 1 1 1 1 1 1 1 1
symmnumber: 1
zpe: 732988.0 jmol-1
zpe.correction: 0.279180 hartree
zpe.thermalcorrener: 0.296269 hartree
zpe.thermalcorrenthalpy: 0.297213 hartree
zpe.thermalcorrgfe: 0.234705 hartree
zpe.sumelectzpe: -1182.531960 hartree
zpe.sumelectthermal: -1182.514872 hartree
zpe.sumelectthermalent: -1182.513928 hartree
zpe.sumelectthermalfe: -1182.576436 hartree
dipole: -4.0527 2.6590 0.6446
dipole: 4.8898
quadrupole: -119.8862 -101.2131 -120.9479
quadrupole: 4.7690 6.6097 -6.0505
quadrupole: -5.8705 12.8027 -6.9321 4.7690 6.6097 -6.0505
hfenergy: -1182.8111408 hartree
pointgroup: C01[X(C13H17N1O3S1)]
dipole: -1.4999191 1.1756121 0.2628715 debye
polarizability: 224.4032768|-1.0078558|195.7622393|0.4189747|1.9878301|115.694694 unknown
InChI: InChI=1S/C13H17NO3S/c15-18(16,17)13-6-3-4-10-8-11-5-1-2-7-14(11)9-12(10)13/h3-4,6,11,15H,1-2,5,7-9H2
charge 0 multiplicity 1
35 atoms
S  2.802274 -1.486644 -0.20216
O  2.338311 -2.102003 1.49859
O  2.06252 -2.438606 -1.284696
O  4.409326 -1.312853 -0.281603
N  -1.757974 -0.538225 0.278138
C  -2.258436 0.697377 -0.386392
C  -3.750739 0.939118 -0.06238
C  -1.422104 1.894321 0.11314
C  -2.599315 -1.738557 0.017207
C  -4.628713 -0.291209 -0.367273
C  -0.359506 -0.853505 -0.101355
C  -4.071701 -1.5120 0.39574
C  0.076668 1.664235 0.059327
C  0.582584 0.33552 -0.015979
C  1.988763 0.210424 -0.038684
C  0.97397 2.760381 0.110393
C  2.902715 1.272849 0.019724
C  2.371691 2.578757 0.093977
H  -2.147283 0.609964 -1.501712
H  -4.097282 1.82422 -0.630736
H  -3.836704 1.182425 1.015898
H  -1.711846 2.09138 1.164954
H  -1.685143 2.798265 -0.469736
H  -2.175276 -2.57926 0.598283
H  -2.546871 -2.02956 -1.066132
H  -4.623038 -0.500847 -1.456893
H  -5.678859 -0.093368 -0.081413
H  -0.301926 -1.258898 -1.145041
H  0.003939 -1.661327 0.56061
H  -4.147348 -1.335901 1.486158
H  -4.651813 -2.424741 0.161796
H  0.562393 3.775378 0.163827
H  3.979599 1.079658 0.002548
H  3.046101 3.439444 0.137249
H  2.690623 -3.036014 1.579128
