program: Gaussian 09
title: 000264053
version: EM64L-G09RevD.01
frameworkgroup: C1[X(C13H13NOS)]
method: RPBEPBE
basis: SDD
operation: Freq
keyword: #p
keyword: freq=noraman
keyword: PBEPBE/SDD
title: #p freq=noraman PBEPBE/SDD
converged: YES YES NO NO
title: Mulliken charges:
elementType: S O N C C C C C C C C C C C C C H H H H H H H H H H H H H
charge: 0.256800 -0.195949 -0.003817 0.237329 0.398592 -0.071260 -0.314930 -0.343009 -0.371719 -0.813428 -0.329107 -0.260503 -0.220907 -0.693673 0.237674 -0.748202 0.246244 0.240734 0.237780 0.236543 0.237776 0.255622 0.228589 0.231265 0.293230 0.293039 0.260846 0.237010 0.237431
chargesum: 0.00000
title: Mulliken charges with hydrogens summed into heavy atoms:
elementType: S O N C C C C C C C C C C C C C
charge: 0.256800 -0.195949 -0.003817 0.237329 0.398592 -0.071260 -0.068686 -0.343009 -0.130985 -0.101329 -0.073484 -0.031914 0.010358 -0.107404 0.237674 -0.012915
polarizability: 2.61467924e+02 -1.96082595e+01 1.93170487e+02 -2.35688616e-02 8.88101166e-04 7.72435019e+01
1716.lowfreq: -70.4105 -3.0495 0.0011 0.0012 0.0013 9.9257 11.6013 25.9438 38.1104
frequency: -70.4029 25.7000 38.0987 64.7836 88.8848 100.4328 148.6904 166.2137 168.4886 210.7749 211.0889 271.0379 292.6419 342.5886 375.2595 421.5505 453.9181 495.0828 504.1775 520.3835 525.8561 545.9331 564.9074 591.5753 661.2864 717.3186 738.8438 770.2504 789.0020 798.9068 830.6989 843.8764 871.8652 880.2504 882.2461 953.2206 961.5178 984.1307 993.8064 1003.5398 1023.5471 1044.8926 1067.8390 1093.6148 1146.8587 1150.1461 1161.2925 1172.8916 1249.7696 1270.8232 1282.4016 1295.9078 1344.1822 1367.4904 1394.0757 1398.7323 1402.7230 1413.5479 1442.7379 1447.4618 1452.9343 1469.5025 1476.5041 1506.0903 1544.5088 1593.7277 1619.9244 1637.2499 2980.4183 2984.7790 3021.3691 3057.4578 3067.5426 3079.9931 3096.3522 3126.0647 3128.8761 3139.7092 3145.1890 3155.9079 3169.1487
redmass: 1.2254 5.1767 4.0486 4.7939 2.4388 3.5014 3.9085 8.1257 1.2464 2.3877 4.6533 3.1896 5.6015 5.0074 7.5680 3.1150 2.0214 4.8270 5.8086 4.9690 3.3262 4.7216 3.8070 8.0025 4.0538 5.0666 5.8141 1.3146 3.1777 1.4414 4.0078 5.9466 1.4374 8.0268 1.5176 1.8127 1.3661 1.9253 1.3232 1.4149 2.4103 1.5724 2.4926 2.2995 1.2706 1.4551 1.7857 1.1445 1.7566 2.1912 2.0682 4.3266 3.0543 1.2343 2.1471 1.0892 1.7374 3.0363 1.0719 2.8474 1.0497 1.0455 1.1285 4.1784 6.5476 6.2625 6.4851 8.0740 1.0378 1.0370 1.0586 1.0971 1.0973 1.1014 1.0985 1.1001 1.0851 1.0895 1.0927 1.0952 1.1001
irintensity: 0.0284 1.1977 9.2708 4.4491 2.0856 0.1692 3.1338 6.0263 0.0053 2.3469 1.1008 0.5034 0.0028 0.2115 2.4589 5.8148 0.3034 2.6850 1.4498 0.2979 1.3388 27.3446 1.0388 11.6950 0.0186 0.5705 7.4064 87.7955 0.3718 0.8254 1.7632 3.4736 17.0834 42.0819 4.2218 5.6209 2.2339 9.5820 0.2139 9.2519 5.4786 6.4596 0.5456 46.5588 0.0589 73.8424 57.4908 1.8198 0.0865 2.7714 29.5841 93.8484 24.2190 59.0048 12.2382 49.9686 11.9958 30.9183 28.3131 2.8088 22.6472 15.7866 47.7357 8.5163 91.1914 142.2010 17.7777 94.5437 22.8357 2.6300 14.0403 15.1838 6.7924 6.2480 18.0056 14.4465 0.1387 8.8167 6.4213 27.3379 25.8311
temp: 298.150 k
press: 1.00000 atm
elementType: 16 8 7 6 6 6 6 6 6 6 6 6 6 6 6 6 1 1 1 1 1 1 1 1 1 1 1 1 1
symmnumber: 1
zpe: 588760.2 jmol-1
zpe.correction: 0.224247 hartree
zpe.thermalcorrener: 0.239058 hartree
zpe.thermalcorrenthalpy: 0.240003 hartree
zpe.thermalcorrgfe: 0.180666 hartree
zpe.sumelectzpe: -1030.083167 hartree
zpe.sumelectthermal: -1030.068356 hartree
zpe.sumelectthermalent: -1030.067411 hartree
zpe.sumelectthermalfe: -1030.126748 hartree
dipole: -3.5122 2.3225 0.0075
dipole: 4.2107
quadrupole: -97.5924 -90.6731 -104.5373
quadrupole: 18.4180 0.0272 -0.0059
quadrupole: 0.0085 6.9279 -6.9364 18.4180 0.0272 -0.0059
hfenergy: -1030.3074139 hartree
pointgroup: C01 [X(C13H13N1O1S1)]
dipole: 1.3929366 -0.8966915 0.0023348 debye
polarizability: 261.9391059|-18.7638008|192.6992904|-0.0564616|0.0099382|77.2435162 unknown
InChI: InChI=1S/C13H13NOS/c1-9-7-13(16-8-10(2)15)14-12-6-4-3-5-11(9)12/h3-7H,8H2,1-2H3
charge 0 multiplicity 1
29 atoms
S  -2.262517 1.324592 0.000822
O  -5.162359 0.722702 0.000759
N  -0.13222 -0.427037 -0.00037
C  2.247044 0.311044 -0.000045
C  1.81574 1.695685 0.000638
C  1.229333 -0.719279 -0.000542
C  0.44517 1.954091 0.000806
C  -0.48998 0.862961 0.00031
C  3.622487 -0.081425 -0.000237
C  2.819873 2.829379 0.001178
C  1.621168 -2.09381 -0.001224
C  3.982754 -1.433931 -0.000889
C  2.974842 -2.446176 -0.001389
C  -2.994982 -0.408979 -0.000202
C  -4.518914 -0.357526 0.003318
C  -5.2131 -1.716556 0.006985
H  0.072351 2.983577 0.001325
H  4.403159 0.68675 0.000145
H  3.47572 2.786567 -0.888677
H  2.31205 3.807671 0.001648
H  3.47572 2.785717 0.890992
H  0.828959 -2.84885 -0.001603
H  5.040006 -1.720691 -0.001018
H  3.266617 -3.502256 -0.001903
H  -2.617986 -0.951214 -0.885424
H  -2.613659 -0.954282 0.881224
H  -6.304608 -1.575736 -0.000207
H  -4.912952 -2.310734 -0.876571
H  -4.923911 -2.298954 0.902048
