program: Gaussian 09
title: 000264050
version: EM64L-G09RevD.01
frameworkgroup: C1[X(C13H10ClNOS)]
method: RPBEPBE
basis: SDD
operation: Freq
keyword: #p
keyword: freq=noraman
keyword: PBEPBE/SDD
title: #p freq=noraman PBEPBE/SDD
converged: YES YES NO NO
title: Mulliken charges:
elementType: Cl S O N C C C C C C C C C C C C C H H H H H H H H H H
charge: -0.030068 0.304835 -0.194451 0.003043 0.295216 -0.843882 0.223304 -0.335204 -0.342432 -0.248380 -0.242670 -0.225289 -0.221622 -0.058387 -0.115188 -0.180890 -0.341277 0.273119 0.306082 0.244570 0.278517 0.231676 0.234631 0.234374 0.266083 0.237489 0.246803
chargesum: 0.00000
title: Mulliken charges with hydrogens summed into heavy atoms:
elementType: Cl S O N C C C C C C C C C C C C C
charge: -0.030068 0.304835 -0.194451 0.003043 0.295216 -0.264681 0.223304 -0.090634 -0.063915 -0.248380 -0.010994 0.009341 0.012752 -0.058387 0.150896 0.056599 -0.094475
polarizability: 2.47415946e+02 7.13990933e+00 1.56551072e+02 -2.09034539e+01 4.37821590e+00 1.23681777e+02
1716.lowfreq: -2.8633 -0.0021 -0.0015 0.0016 5.4010 10.8427 16.2489 27.4320 32.8750
frequency: 15.8753 27.3594 32.7232 59.3510 116.3514 122.1989 145.2142 155.7299 204.8761 233.4610 267.1348 305.9075 350.3481 398.4677 404.0290 408.1229 444.9945 447.6628 460.6243 515.0115 553.1072 613.1031 629.4363 634.7548 696.8174 727.5190 731.2584 738.2782 759.5594 769.6301 792.6311 858.9214 888.9213 921.6633 951.5445 964.2944 983.8311 985.9799 989.7566 991.8108 1011.7380 1028.0724 1045.0183 1086.4462 1119.3313 1142.5265 1173.4128 1188.1539 1190.6514 1210.8416 1225.6745 1282.6582 1320.5139 1322.9707 1376.7423 1387.5982 1390.2130 1409.0307 1436.4808 1479.0946 1533.9071 1559.8272 1578.3544 1602.4690 1617.9567 3014.7444 3091.8884 3129.0490 3139.0255 3143.5551 3150.0902 3159.4148 3162.9775 3169.8623 3182.2890
redmass: 6.2169 6.6046 6.3347 6.5744 5.4932 8.9705 5.7784 8.3906 2.8431 5.0916 7.1846 6.8927 8.5805 2.9744 3.1877 7.3279 4.5131 7.8499 7.6983 3.9665 2.7764 6.4610 7.8546 7.8475 1.8376 5.0193 7.1956 6.4798 2.1550 3.5636 1.2889 1.2625 2.1046 1.3521 1.5417 1.3840 4.7616 7.3974 6.2177 1.3833 1.3428 2.0276 2.9489 1.5897 1.4877 2.6751 1.0751 1.1804 1.1673 1.7392 1.6860 1.7757 1.4204 6.7690 1.0964 8.8298 2.5187 1.7606 2.2642 2.2057 6.5229 6.2989 6.5939 6.6659 7.7096 1.0583 1.1021 1.0851 1.0881 1.0887 1.0924 1.0962 1.0919 1.1013 1.1004
irintensity: 0.3059 1.7031 0.3387 2.4861 1.7611 0.3372 0.5400 0.8741 5.5693 2.6930 13.7152 1.6432 7.7138 0.7524 1.0452 5.2736 0.9409 4.8200 3.6046 0.7546 5.7593 0.0202 9.2025 19.3523 45.7649 10.8666 65.1780 1.6530 49.6686 14.6471 56.8786 0.3989 1.8846 0.0247 0.7927 0.6391 92.8259 36.1020 4.3920 0.7512 0.3058 0.4979 14.3710 9.0661 8.4996 66.4898 7.2885 55.7858 2.5560 106.6153 0.5818 69.2445 9.4671 14.7555 22.0363 5.5176 134.7701 30.8235 20.8662 0.2779 3.1581 73.4453 48.1488 40.7598 24.6356 32.0504 0.3244 0.2376 7.1217 8.5051 18.3149 19.8318 8.3387 22.9945 13.0729
temp: 298.150 k
press: 1.00000 atm
elementType: 17 16 8 7 6 6 6 6 6 6 6 6 6 6 6 6 6 1 1 1 1 1 1 1 1 1 1
symmnumber: 1
zpe: 510571.2 jmol-1
zpe.correction: 0.194466 hartree
zpe.thermalcorrener: 0.209738 hartree
zpe.thermalcorrenthalpy: 0.210682 hartree
zpe.thermalcorrgfe: 0.148601 hartree
zpe.sumelectzpe: -1488.273486 hartree
zpe.sumelectthermal: -1488.258215 hartree
zpe.sumelectthermalent: -1488.257271 hartree
zpe.sumelectthermalfe: -1488.319351 hartree
dipole: 2.1993 2.8753 -2.1994
dipole: 4.2357
quadrupole: -89.2033 -107.7137 -112.0063
quadrupole: -8.6888 -3.6038 3.2312
quadrupole: 13.7711 -4.7393 -9.0318 -8.6888 -3.6038 3.2312
hfenergy: -1488.4679527 hartree
pointgroup: C01 [X(C13H10Cl1N1O1S1)]
dipole: -0.7669082 -1.0464717 -1.045871 debye
polarizability: 245.5025717|10.8853865|158.2795198|23.5967851|2.8977748|123.866704 unknown
InChI: InChI=1S/C13H10ClNOS/c14-11-7-4-8-15-13(11)17-9-12(16)10-5-2-1-3-6-10/h1-8H,9H2
charge 0 multiplicity 1
27 atoms
Cl 4.579342 1.797792 0.76092
S  1.463436 1.90257 -0.16549
O  -0.457475 0.389675 1.64726
N  1.761085 -0.793213 -0.659845
C  -2.40872 0.161458 0.249503
C  -0.231122 1.259647 -0.63191
C  -0.991695 0.589351 0.523721
C  -3.027032 0.306309 -1.022537
C  -3.149616 -0.415615 1.317678
C  2.385789 0.326574 -0.217898
C  -4.358737 -0.117712 -1.21963
C  -4.47892 -0.836242 1.120239
C  -5.087516 -0.688141 -0.150196
C  3.744996 0.287005 0.190578
C  4.455087 -0.923778 0.1565
C  3.789325 -2.089232 -0.296237
C  2.442541 -1.972353 -0.698056
H  -0.780604 2.133186 -1.02288
H  -0.089693 0.521231 -1.441423
H  -2.476499 0.740191 -1.863851
H  -2.654331 -0.521084 2.288643
H  -4.8280 -0.005729 -2.203131
H  -5.042551 -1.277964 1.949165
H  -6.121696 -1.015481 -0.305336
H  5.500021 -0.954293 0.478477
H  4.304338 -3.053138 -0.332644
H  1.878746 -2.838419 -1.060117
