program: Gaussian 09
title: 000264043
version: EM64L-G09RevD.01
frameworkgroup: C1[X(C12H8BrNOS)]
method: RPBEPBE
basis: SDD
operation: Freq
keyword: #p
keyword: freq=noraman
keyword: PBEPBE/SDD
title: #p freq=noraman PBEPBE/SDD
converged: YES YES NO NO
title: Mulliken charges:
elementType: Br S O N C C C C C C C C C C C C H H H H H H H H
charge: 0.037105 0.187723 -0.202182 0.002882 0.414535 -0.340477 -0.284605 -0.234190 -0.182163 -0.182387 -0.205959 -0.277670 -0.109562 -0.193895 -0.167676 -0.353883 0.281486 0.260611 0.258790 0.258153 0.306689 0.243770 0.235117 0.247787
chargesum: 0.00000
title: Mulliken charges with hydrogens summed into heavy atoms:
elementType: Br S O N C C C C C C C C C C C C
charge: 0.037105 0.187723 -0.202182 0.002882 0.414535 -0.058991 -0.023994 -0.234190 0.076627 0.075766 -0.205959 -0.277670 0.197127 0.049875 0.067441 -0.106096
polarizability: 3.57119172e+02 2.38187702e+00 1.56987329e+02 6.97625932e-01 7.27658617e-02 6.05125539e+01
1716.lowfreq: -6.8451 0.0004 0.0009 0.0011 3.2510 4.1343 17.3296 25.9009 36.7356
frequency: 16.3801 25.8809 36.6464 63.0727 82.6585 139.9179 174.4959 184.6387 245.5453 255.2037 280.8927 332.5936 400.6677 405.5446 427.6316 454.8832 464.0222 475.7268 551.3741 606.2274 620.1809 621.0594 692.8557 699.8092 723.2744 748.2340 776.2221 833.4070 851.0259 866.5570 912.3503 947.2041 964.1803 969.3608 990.5286 996.3126 1012.6556 1036.8212 1060.6058 1067.6889 1105.8774 1118.4630 1170.7086 1187.3092 1206.2448 1284.6624 1298.8653 1321.4086 1368.0499 1396.0352 1403.4105 1430.7874 1467.4843 1554.3409 1560.6128 1564.1189 1588.7905 1598.2627 3139.0131 3148.8924 3153.3965 3158.3638 3173.2992 3176.4586 3179.6864 3191.7072
redmass: 7.5525 4.5671 7.3169 8.6147 9.5517 9.7867 5.5880 9.4038 7.2238 6.2893 10.9099 6.7295 2.8733 3.3923 14.4193 10.9371 3.7186 3.2871 10.1335 7.5949 6.1885 5.6359 7.9886 7.1626 3.7344 3.7989 1.3192 1.3080 1.4807 7.7604 1.2724 6.7008 1.4275 1.3674 1.3631 4.6212 1.3141 2.8983 2.7516 2.2834 2.1923 1.3721 1.0906 1.4401 2.2645 1.5028 1.2611 9.7517 4.8607 3.9494 1.8836 1.8814 2.2498 5.4910 7.7058 6.1216 6.2518 9.6243 1.0875 1.0919 1.0893 1.0887 1.0992 1.0961 1.0974 1.0971
irintensity: 1.2229 0.2413 1.1658 0.2939 3.1032 4.5144 0.9322 5.2930 0.8854 3.1198 0.0459 18.0982 0.1137 5.2100 7.9242 10.5953 13.8303 4.2669 34.8504 3.8322 9.5863 14.9081 45.1219 29.4569 5.7017 5.7738 76.5507 11.1848 51.8153 399.5752 0.3576 9.5622 1.6565 0.2380 1.1131 44.7558 1.0211 18.2149 82.6653 32.4606 83.2160 12.3060 4.1599 148.7874 116.8852 2.4608 0.7846 3.2200 9.8433 18.3299 39.3758 158.7738 41.5496 62.1675 23.8986 107.4763 140.5351 95.3579 7.0930 19.5940 2.4549 0.1111 23.8295 3.9630 2.3097 29.2165
temp: 298.150 k
press: 1.00000 atm
elementType: 35 16 8 7 6 6 6 6 6 6 6 6 6 6 6 6 1 1 1 1 1 1 1 1
symmnumber: 1
zpe: 436401.2 jmol-1
zpe.correction: 0.166216 hartree
zpe.thermalcorrener: 0.180497 hartree
zpe.thermalcorrenthalpy: 0.181441 hartree
zpe.thermalcorrgfe: 0.120795 hartree
zpe.sumelectzpe: -1002.458347 hartree
zpe.sumelectthermal: -1002.444066 hartree
zpe.sumelectthermalent: -1002.443122 hartree
zpe.sumelectthermalfe: -1002.503768 hartree
dipole: -1.2468 1.1046 -0.0448
dipole: 1.6664
quadrupole: -87.2529 -105.4047 -113.8948
quadrupole: -5.2552 0.3578 0.2733
quadrupole: 14.9312 -3.2206 -11.7106 -5.2552 0.3578 0.2733
hfenergy: -1002.6245631 hartree
pointgroup: C01 [X(C12H8Br1N1O1S1)]
dipole: -0.5013817 0.4158464 -0.0741245 debye
dipolederiv: -0.9509638 0.0709625 0.0441257 0.1060708 -0.0555317 0.0004621 0.0383566 0.0028597 -0.0210914 -1.176615 -0.2627825 0.1238995 -0.6590353 -0.2553715 0.0891406 0.2241442 0.0673347 -0.0682111 -0.8657236 0.19991 -0.0061666 -0.1556573 -0.991921 0.1788411 0.0836703 0.1532796 -0.2921126 -0.9770179 -0.0606913 0.0540198 -0.4187848 -0.3942695 0.0638993 0.1222174 0.0447568 -0.2088948 -1.003734 0.060244 0.0510507 -0.0749904 -0.0913634 0.0277329 0.0764597 0.0172657 0.0017543 0.2577087 -0.1379942 0.0047432 0.3095422 0.0281361 -0.0420018 -0.0865678 -0.0158854 -0.0871325 0.1745158 0.0506961 -0.0245035 -0.260386 -0.0014126 -0.0014612 0.0447309 -0.0222126 -0.0994623 2.2132121 0.0669841 -0.1557176 1.0640945 1.1702398 -0.3134686 -0.3882184 -0.2472373 0.1805277 -0.6063115 0.2459438 -0.0148695 0.2873489 -0.0399814 -0.02814 -0.0227383 -0.0250424 -0.0865972 -0.6413904 -0.1293069 0.0580728 -0.1679687 0.0375226 -0.0139391 0.0660947 -0.0165006 -0.0925392 1.6092007 -0.1401983 -0.0797437 -0.2130815 0.1337664 -0.034406 -0.0673368 -0.0385416 -0.1035607 1.8708143 0.1110987 -0.1176878 -0.1578129 0.0870757 -0.0046856 -0.0564994 -0.0206038 0.0136238 -0.7501789 0.0598236 0.0231136 0.2775907 -0.1246114 0.0008551 -0.0301944 0.0091876 -0.0645114 0.3121903 -0.0364833 -0.0120309 0.0468874 0.195396 -0.06894 -0.0283147 -0.0660264 -0.1031982 -0.1129635 -0.009185 0.0041648 -0.2117176 -0.2554629 0.0399905 0.0451906 0.0307304 -0.1256548 0.2884673 0.0070421 -0.0178644 0.3477588 0.3521543 -0.1103573 -0.0861239 -0.0925689 -0.0547134 0.115345 0.0762772 -0.0120373 0.0302393 0.0318732 0.021462 -0.0009142 0.0200849 0.1541633 0.0696407 -0.0752363 0.0204082 -0.105283 0.0448779 0.0262535 0.0220038 0.0267154 0.1493951 0.014527 -0.0707928 0.0225984 -0.0679555 0.0213201 0.0309888 0.0227166 0.0309333 0.1546678 0.050871 0.0506333 -0.0027835 0.064543 -0.0060817 0.0276262 -0.0063971 0.0280987 0.1564223 0.246633 -0.0680592 0.0081121 -0.0391078 0.0751525 0.0210067 0.0020872 0.0236309 0.161697 0.0261217 0.0581171 -0.006723 0.0910883 -0.0475676 0.0375187 -0.0141025 0.0393966 0.1408468 -0.1308817 0.011736 0.0108551 0.0349674 0.1074369 0.0113046 0.0045152 0.0125863 0.1654751 -0.0334672 -0.0787389 0.0249642 -0.1283503 -0.021377 0.0403175 0.0352204 0.0377584 0.1291064 unknown
polarizability: 355.9149216|3.7652371|153.1177552|-18.0114085|-19.4164479|65.5863773 unknown
InChI: InChI=1S/C12H8BrNOS/c13-10-6-4-9(5-7-10)12(15)16-11-3-1-2-8-14-11/h1-8H
charge 0 multiplicity 1
24 atoms
Br 6.37314 -0.336939 -0.315077
S  -0.847286 -1.053191 0.333411
O  -0.335997 1.600563 -0.307486
N  -3.424774 -1.629251 0.565271
C  1.633155 0.210671 -0.12655
C  2.476849 1.324237 -0.391945
C  2.217947 -1.066928 0.080896
C  0.160364 0.468496 -0.085593
C  3.875589 1.172125 -0.448717
C  3.616535 -1.232057 0.026471
C  4.430462 -0.109123 -0.237697
C  -2.635884 -0.558935 0.301938
C  -3.128009 0.743255 0.045595
C  -4.530478 0.917261 0.067579
C  -5.37418 -0.184721 0.339082
C  -4.77463 -1.4407 0.582974
H  2.01793 2.304859 -0.551832
H  1.591538 -1.9416 0.282699
H  4.520618 2.031178 -0.65247
H  4.064073 -2.216647 0.185515
H  -2.444783 1.568413 -0.159877
H  -4.953485 1.908577 -0.126104
H  -6.462883 -0.078898 0.36288
H  -5.377306 -2.329246 0.799834
