program: Gaussian 09
title: 000264035
version: EM64L-G09RevD.01
frameworkgroup: C1[X(C9H11NOS)]
method: RPBEPBE
basis: SDD
operation: Freq
keyword: #p
keyword: freq=noraman
keyword: PBEPBE/SDD
title: #p freq=noraman PBEPBE/SDD
converged: YES YES NO NO
title: Mulliken charges:
elementType: S O N C C C C C C C C C H H H H H H H H H H H
charge: 0.206442 -0.198152 -0.058698 -0.816104 0.282897 -0.734546 -0.311123 0.263253 -0.170340 -0.749420 -0.180452 -0.352602 0.264479 0.276509 0.270384 0.316995 0.241259 0.241155 0.257331 0.231088 0.246057 0.234094 0.239494
chargesum: 0.00000
title: Mulliken charges with hydrogens summed into heavy atoms:
elementType: S O N C C C C C C C C C
charge: 0.206442 -0.198152 -0.058698 -0.275116 0.282897 -0.147167 -0.069864 0.263253 0.070815 -0.014944 0.053642 -0.113107
polarizability: 1.48496984e+02 4.38188678e+00 1.26776978e+02 -1.11092070e+01 8.67085646e+00 8.78334035e+01
1716.lowfreq: -6.3248 -5.9445 -0.0009 0.0019 0.0028 9.9111 23.0955 35.1232 48.3324
frequency: 23.0463 34.9446 48.3245 85.2609 105.5593 122.0394 145.7525 187.6677 267.3486 336.5852 350.6062 403.2995 457.5176 473.6680 541.4223 572.5933 620.3236 645.1150 729.2768 749.3588 790.6126 795.7520 819.1761 835.4343 880.5917 899.8405 960.3130 962.9469 967.4081 1000.9338 1001.5063 1040.5463 1083.0727 1140.0474 1152.8647 1165.5812 1166.0963 1231.4201 1252.0421 1283.8253 1296.8741 1320.7518 1368.6457 1414.6537 1420.7362 1435.0357 1443.7607 1455.0731 1455.9389 1563.0577 1582.1009 1635.1611 2972.1142 2983.6659 3032.8136 3042.0363 3072.1932 3118.0951 3120.0083 3127.8512 3138.8824 3155.5033 3172.4462
redmass: 4.5852 4.6684 4.2094 1.2422 5.2903 2.5924 3.3855 6.8190 6.1610 3.5768 2.0819 3.4586 2.0956 3.8410 4.3721 5.0030 6.3733 5.1415 4.7327 1.6978 2.6149 1.6408 4.1384 2.7047 1.8555 1.3544 1.4456 2.2056 3.8201 1.3618 1.4008 2.3572 1.6033 1.1692 1.2434 1.4790 1.2868 1.2915 2.6566 1.8054 1.7058 3.4123 1.2229 1.8929 1.1064 1.1257 1.0623 2.1876 1.0890 5.8062 5.7237 8.1775 1.0571 1.0384 1.1019 1.0597 1.0951 1.1072 1.1010 1.0883 1.0890 1.0949 1.1016
irintensity: 0.4095 5.3457 6.5208 1.2082 1.6039 2.8634 6.8282 0.8609 2.9419 0.2379 3.1552 6.7148 1.1023 4.6743 14.9270 11.3281 2.2736 12.9606 6.5845 33.4002 20.6003 0.4268 8.6074 3.2064 0.9926 0.5851 0.7173 2.4489 5.3212 3.3995 10.2488 4.0513 5.0478 6.9038 11.7235 32.5146 31.5608 0.9617 0.7093 62.8460 4.3466 0.5123 51.0217 16.5962 44.4123 7.6314 14.9401 49.1779 14.2966 10.6258 44.2525 98.3943 41.5297 6.4038 11.4877 16.7353 13.9191 3.5918 13.4448 13.3748 4.5403 22.9123 19.5536
temp: 298.150 k
press: 1.00000 atm
elementType: 16 8 7 6 6 6 6 6 6 6 6 6 1 1 1 1 1 1 1 1 1 1 1
symmnumber: 1
zpe: 470474.1 jmol-1
zpe.correction: 0.179194 hartree
zpe.thermalcorrener: 0.191768 hartree
zpe.thermalcorrenthalpy: 0.192713 hartree
zpe.thermalcorrgfe: 0.137544 hartree
zpe.sumelectzpe: -876.687378 hartree
zpe.sumelectthermal: -876.674804 hartree
zpe.sumelectthermalent: -876.673860 hartree
zpe.sumelectthermalfe: -876.729028 hartree
dipole: 3.7019 2.2718 1.7480
dipole: 4.6820
quadrupole: -75.0796 -71.5753 -81.5819
quadrupole: -7.7650 -13.4974 -2.2234
quadrupole: 0.9993 4.5036 -5.5030 -7.7650 -13.4974 -2.2234
hfenergy: -876.866572 hartree
pointgroup: C01 [X(C9H11N1O1S1)]
dipole: -1.371812 1.2232314 0.1221638 debye
dipolederiv: -0.2251879 -0.0037793 0.1264928 -0.1038295 -0.0233558 -0.1053732 0.1373937 -0.0726809 -0.1859904 -0.6283233 0.1092508 -0.1372934 0.1063513 -0.7269877 0.0432445 -0.2602457 0.0539937 -0.3766794 -0.4006027 0.020732 0.077244 0.1751374 -0.3993874 -0.1049579 0.0891821 -0.0293075 -0.3261349 0.1702125 0.0153985 0.0826069 0.0197915 0.0301399 -0.0087553 -0.0265916 -0.0135945 0.1351701 0.3923168 -0.1729352 -0.3330684 -0.0988249 0.1263992 0.0882777 -0.3574441 0.1669144 0.1912158 -0.2242554 0.1991928 -0.2128778 0.437327 0.0066263 0.0988191 -0.3134138 0.0453803 -0.0640421 -0.3030581 0.1089131 0.1543681 -0.014764 0.0585074 0.0865569 0.2256669 -0.0719082 -0.2369765 0.84464 0.0239095 0.4249434 -0.0902278 0.8951242 0.0080485 0.675056 0.1037929 0.423114 0.0986111 0.0785026 -0.1325684 0.0238319 0.1271502 0.0562082 -0.1834765 0.045215 0.0534631 -0.1606397 -0.1523273 -0.0979453 -0.1740992 -0.3244721 -0.1649807 -0.1922255 -0.2468138 -0.0815423 -0.0948264 -0.146394 -0.0989396 0.0270577 -0.2196831 -0.007123 0.0053734 0.0830066 -0.0367004 0.0314365 0.1799066 -0.0406222 -0.0385243 0.3315329 0.1570201 -0.0834076 0.0263006 0.0446864 -0.0350599 -0.0706735 -0.0676766 -0.0325805 0.005777 -0.0995682 -0.0086967 -0.0347077 0.0600733 0.0016495 0.0046308 0.0363776 0.0361622 -0.0049494 0.1235684 0.01046 0.0437654 -0.0107483 -0.0018597 -0.0705373 0.0278174 -0.1252305 0.0018913 0.0511407 0.0268514 0.0650477 -0.0172076 0.201651 -0.0155002 -0.0227618 -0.0827317 -0.0128962 -0.08095 0.0177027 -0.0578606 0.0521902 0.1273405 -0.0242162 0.0200339 -0.0413669 -0.0553326 -0.0687314 0.0060523 -0.0736653 0.0950437 -0.0071418 -0.0784034 0.089688 -0.0880994 0.0525007 0.0316278 0.0887883 0.0309458 0.0820966 -0.103461 -0.0158357 -0.0624922 0.0251907 0.0753118 0.0016461 -0.0682287 0.0016131 0.1084471 0.1161108 0.0096853 -0.0471905 0.0171865 0.0016471 0.0906295 -0.0027737 0.1341602 -0.0070731 0.0473692 0.017928 0.099969 0.0003543 0.0848069 -0.0306513 0.0753729 -0.0439855 -0.0019132 0.0564923 0.037885 0.1100577 0.0328089 0.0641804 -0.0802132 0.1129938 -0.0882322 0.0212968 0.0965857 -0.055333 0.0038374 -0.0109205 -0.0945309 -0.0854834 0.0256103 -0.0673793 0.0782112 unknown
polarizability: 146.4927392|2.9414657|120.4398445|-15.1346351|17.0759369|96.1747816 unknown
InChI: InChI=1S/C9H11NOS/c1-8(11)6-12-7-9-4-2-3-5-10-9/h2-5H,6-7H2,1H3
charge 0 multiplicity 1
23 atoms
S  1.289741 -1.828686 -1.356942
O  3.855087 -1.505976 0.143173
N  -0.911676 0.772595 -0.526188
C  -0.340374 -1.080082 -2.025073
C  -1.199407 -0.511408 -0.924806
C  2.176793 -0.190709 -1.048156
C  -2.236397 -1.269165 -0.319019
C  3.397565 -0.373392 -0.156035
C  -3.002244 -0.690381 0.714942
C  4.026646 0.917019 0.363128
C  -2.709997 0.630819 1.12673
C  -1.656461 1.315214 0.480713
H  -0.832085 -1.919132 -2.542357
H  -0.072832 -0.301829 -2.757086
H  2.502876 0.231536 -2.019573
H  1.454122 0.522006 -0.605889
H  -2.429177 -2.292895 -0.655848
H  -3.810169 -1.256623 1.190465
H  5.077578 0.739117 0.640762
H  3.959383 1.736677 -0.373819
H  3.478956 1.242895 1.26916
H  -3.279616 1.11899 1.923482
H  -1.393712 2.33981 0.769138
