program: Gaussian 09
title: 000264027
version: EM64L-G09RevD.01
frameworkgroup: C1[X(C8H4Cl6S)]
method: RPBEPBE
basis: SDD
operation: Freq
keyword: #p
keyword: freq=noraman
keyword: PBEPBE/SDD
title: #p freq=noraman PBEPBE/SDD
converged: NO YES NO NO
title: Mulliken charges:
elementType: Cl Cl Cl Cl Cl Cl S C C C C C C C C H H H H
charge: 0.044488 0.052906 0.064422 -0.013982 0.019653 0.024341 0.352904 -0.159627 -0.552457 -0.100008 -0.188378 -0.520108 -0.073017 -0.172287 -0.076976 0.362039 0.349803 0.295117 0.291169
chargesum: 0.00000
title: Mulliken charges with hydrogens summed into heavy atoms:
elementType: Cl Cl Cl Cl Cl Cl S C C C C C C C C
charge: 0.044488 0.052906 0.064422 -0.013982 0.019653 0.024341 0.352904 -0.159627 -0.190419 -0.100008 0.106738 -0.170305 -0.073017 0.118882 -0.076976
polarizability: 2.34583428e+02 1.12023437e+01 1.55320494e+02 -8.81604886e+00 7.09024799e+00 1.06856136e+02
1716.lowfreq: -3.6384 -0.0035 -0.0033 -0.0028 2.5656 6.2673 16.7939 22.3272 36.7078
frequency: 16.7637 22.2185 36.6644 61.2297 77.3728 119.2381 135.9528 157.0829 161.1770 182.8317 195.6368 207.9557 236.3688 270.2563 291.0097 311.1683 343.1838 362.7222 448.0840 470.9197 477.5898 509.5921 578.5178 586.3142 604.5795 654.2073 665.5813 686.6941 715.8422 735.6783 808.5907 862.7795 896.5682 1006.9210 1045.5635 1102.7510 1136.3225 1178.8762 1188.2025 1220.9071 1235.3673 1262.3130 1299.9933 1353.4469 1420.9020 1542.8905 1560.8154 3104.5925 3123.2941 3179.8537 3183.0008
redmass: 21.0259 23.4401 20.1037 25.8012 23.7007 16.9839 12.3451 25.5912 22.6063 27.9547 12.8925 7.7095 20.8815 16.4823 18.3023 25.1315 25.7941 12.4200 3.2303 13.5891 6.2099 8.5403 9.2564 9.6945 10.0043 10.0816 7.6593 3.9744 6.0229 6.1733 11.7857 1.4356 1.3974 9.4474 3.3176 1.5999 8.1562 1.0811 1.1195 1.2666 1.1842 1.1827 8.9592 10.3699 2.7114 10.1175 7.9465 1.0860 1.0880 1.0927 1.0935
irintensity: 0.7013 0.0729 0.3390 0.1295 0.1574 0.3514 0.3827 0.4129 0.2913 0.2467 0.5496 0.6692 0.0583 4.1732 0.3447 0.6294 5.1897 1.6549 17.2306 12.9600 2.5410 18.2499 25.4069 45.3665 14.3282 112.2776 8.5815 7.5683 36.8974 65.9733 12.5927 10.8394 22.0783 91.7487 32.1746 26.2784 25.0483 3.6389 3.6692 5.5191 0.9092 11.4548 32.1257 0.6204 146.1573 5.4506 13.4754 2.0153 1.3849 3.3452 0.6415
temp: 298.150 k
press: 1.00000 atm
elementType: 17 17 17 17 17 17 16 6 6 6 6 6 6 6 6 1 1 1 1
symmnumber: 1
zpe: 257414.7 jmol-1
zpe.correction: 0.098044 hartree
zpe.thermalcorrener: 0.114446 hartree
zpe.thermalcorrenthalpy: 0.115391 hartree
zpe.thermalcorrgfe: 0.049516 hartree
zpe.sumelectzpe: -3464.551956 hartree
zpe.sumelectthermal: -3464.535553 hartree
zpe.sumelectthermalent: -3464.534609 hartree
zpe.sumelectthermalfe: -3464.600484 hartree
dipole: -1.5797 2.0491 -0.5899
dipole: 2.6537
quadrupole: -147.1343 -132.9931 -137.9542
quadrupole: 1.6506 -1.7861 2.1399
quadrupole: -7.7738 6.3674 1.4063 1.6506 -1.7861 2.1399
hfenergy: -3464.6499997 hartree
pointgroup: C01 [X(C8H4Cl6S1)]
dipole: 0.7165942 0.724846 -0.2261287 debye
dipolederiv: -0.2200872 -0.0484546 -0.0481331 -0.2736209 -0.655204 -0.1295701 -0.0904482 -0.0010443 -0.1039314 -0.3938671 -0.0271452 -0.2422591 -0.0549431 -0.1046385 -0.1488362 -0.2907897 -0.0930725 -0.6127168 -0.4086947 0.0494802 0.226167 -0.0121867 -0.0672429 0.0151248 0.1766913 -0.0455101 -0.4578517 -0.2719004 0.2158507 -0.1438668 0.2034914 -0.3823622 0.2403786 -0.1642796 0.2689137 -0.2238851 -0.2624761 0.2179163 -0.172768 0.3067164 -0.3393392 0.2729296 -0.2172935 0.2560726 -0.2264249 -0.7776021 0.0705427 0.1165603 0.0735551 -0.0374012 0.00831 0.1919303 0.0031825 -0.0615807 -0.0699444 -0.0970358 -0.2005002 -0.055703 -0.1203095 0.0304676 -0.3790114 -0.0969333 -0.0098828 0.3859918 0.1274743 -0.0814422 0.0065737 -0.1522867 0.0203961 -0.037002 -0.00513 -0.1784585 0.140748 0.2248888 0.2321393 0.3640475 0.918426 0.1440764 0.5352839 0.1414808 0.0867852 0.2382627 -0.4131372 0.2523449 -0.1515631 0.506422 -0.4166232 0.1484549 -0.4238481 0.2651461 -0.2087703 0.0976199 -0.1150867 0.0052241 -0.1130242 0.0857876 0.0374568 0.0660026 -0.0779939 0.8753844 -0.0606487 0.0299224 0.0003486 0.058278 0.1396814 -0.0400618 0.1470375 1.1863453 0.0669106 -0.4341606 0.4090779 -0.4261536 0.4902561 -0.4597871 0.3598118 -0.386375 0.2745421 -0.4006758 0.1232959 -0.0261306 0.1291352 -0.1515774 0.0641577 -0.0066602 0.0796111 -0.0887254 1.1294798 -0.0202108 -0.3246617 -0.1032006 -0.0334318 0.0332408 -0.3003851 -0.005716 0.0386661 0.0139684 -0.0078282 0.0250833 0.0307941 -0.0245374 0.012133 0.0023708 0.0031184 0.0194826 0.0064175 -0.0232235 0.0043909 -0.0364826 0.0046228 -0.007235 0.0097764 -0.0126817 -0.0332662 0.0934181 0.0014803 0.0363669 -0.007614 0.0917049 0.0376309 0.0398734 0.0448589 0.1045307 0.0634369 0.0032955 0.0227956 0.0015814 0.1116453 0.0577371 0.0242821 0.0600329 0.0992194 unknown
polarizability: 230.374003|-18.1247104|131.989563|12.2581355|-27.9791962|134.396492 unknown
InChI: InChI=1S/C8H4Cl6S/c9-3-1-5(11)6(2-4(3)10)15-8(14)7(12)13/h1-2,7-8H
charge 0 multiplicity 1
19 atoms
Cl -2.334062 -2.227141 -0.179988
Cl -4.276529 -0.287546 -2.201576
Cl -4.667699 0.137134 0.809308
Cl 0.163886 2.191875 -1.311012
Cl 3.446784 -2.233808 2.00081
Cl 4.912318 -0.430349 -0.332122
S  -1.334361 0.424015 1.135533
C  0.416519 0.171018 0.638938
C  -2.163021 -0.368555 -0.368738
C  1.067527 0.934625 -0.359641
C  1.169298 -0.797238 1.343712
C  -3.496491 0.326094 -0.620789
C  2.537497 -0.988857 1.06468
C  2.430239 0.747081 -0.656564
C  3.166332 -0.217383 0.06286
H  -1.502565 -0.221909 -1.235768
H  -3.345948 1.405264 -0.759611
H  0.680027 -1.405136 2.108914
H  2.918245 1.343519 -1.431145
