program: Gaussian 09
title: 000263992
version: EM64L-G09RevD.01
frameworkgroup: C1[X(C14H14N8S2)]
method: RPBEPBE
basis: SDD
operation: Freq
keyword: #p
keyword: freq=noraman
keyword: PBEPBE/SDD
title: #p freq=noraman PBEPBE/SDD
converged: YES YES NO NO
title: Mulliken charges:
elementType: S S N N N N N N N N C C C C C C C C C C C C C C H H H H H H H H H H H H H H
charge: 0.278188 0.278231 -0.167407 -0.167077 -0.045679 -0.045495 -0.031742 -0.031737 0.004099 0.004037 -0.394251 -0.394724 0.166184 0.166536 0.123051 0.122919 -0.201264 -0.201843 -0.360731 -0.360521 -0.379277 -0.378946 -0.823199 -0.823223 0.239366 0.266638 0.266522 0.239257 0.269476 0.269421 0.248813 0.248873 0.284133 0.281498 0.242076 0.242045 0.284002 0.281749
chargesum: 0.00000
title: Mulliken charges with hydrogens summed into heavy atoms:
elementType: S S N N N N N N N N C C C C C C C C C C C C C C
charge: 0.278188 0.278231 -0.167407 -0.167077 -0.045679 -0.045495 -0.031742 -0.031737 0.004099 0.004037 0.111753 0.111055 0.166184 0.166536 0.123051 0.122919 0.068212 0.067578 -0.360731 -0.360521 -0.130463 -0.130074 -0.015493 -0.015427
polarizability: 1.89812513e+02 -8.98119474e-02 2.95774292e+02 1.24808386e+01 -1.64150118e-01 2.25617094e+02
1716.lowfreq: -4.0383 -0.0014 -0.0009 0.0015 3.9821 6.2902 6.6467 15.0044 27.6306
frequency: 5.9174 14.9903 27.6189 42.6689 56.6432 75.2436 78.4326 97.1118 108.2246 115.1533 143.4988 148.4488 160.2347 196.9851 230.5951 234.2378 242.8840 253.9518 254.2530 272.2147 279.7647 329.8561 401.9952 403.1065 438.7748 509.1780 532.9857 540.8063 553.6530 557.6766 583.0180 627.6635 629.9172 637.7082 643.9922 647.9660 649.9214 661.9742 662.5881 690.6429 700.3089 790.8143 791.1943 813.1189 813.9185 830.3728 830.9216 895.8928 901.4220 920.7323 920.9125 925.4288 955.4775 978.2897 978.4272 991.5393 992.2514 1016.2136 1100.1955 1104.9149 1109.6967 1148.1302 1163.2828 1186.0338 1197.7851 1214.7012 1243.0094 1259.1987 1289.5646 1290.5504 1303.4621 1304.3430 1310.9761 1343.8881 1345.4366 1347.1629 1369.2975 1371.7210 1371.7850 1378.5600 1394.1954 1394.2646 1434.2448 1434.3740 1438.9193 1446.5279 1448.3526 1449.2592 1463.4567 1470.0904 1521.3258 1522.2391 1543.4962 1546.9544 3011.3282 3018.3166 3027.1782 3027.2515 3073.5094 3087.7875 3152.3706 3152.5414 3159.2908 3159.3124 3174.1315 3174.1879 3233.8838 3234.1094
redmass: 6.0059 8.7064 6.2900 6.2398 4.9522 4.1418 3.5329 2.2899 1.1372 1.5640 4.2744 7.9828 4.3045 8.5834 5.8033 3.3201 4.3128 4.4842 4.2062 2.5483 6.2420 7.4445 9.8303 10.5628 3.3876 4.1459 4.2665 4.6280 7.0071 7.9389 5.6298 7.6367 6.7466 4.3646 4.8527 6.8513 5.0078 7.6070 7.1220 7.2084 4.2782 4.8220 5.0859 10.7472 11.2284 1.6830 1.6968 6.0466 5.7884 1.4503 1.4373 2.6654 2.8062 1.1804 1.1802 1.2931 1.3121 2.4441 3.6670 6.0535 3.7364 5.2013 4.2718 3.5951 2.0534 1.9116 2.0940 1.5925 7.3086 5.9306 4.8890 4.6614 2.7720 1.3834 1.1362 1.5844 3.6440 2.9672 2.0768 1.2761 1.6959 1.6937 1.0523 1.0522 2.4158 2.0973 1.0561 1.1947 1.3243 1.3817 9.2876 9.4325 8.6017 9.5848 1.0596 1.0613 1.0282 1.0282 1.1053 1.1040 1.1043 1.1043 1.1055 1.1055 1.0924 1.0924 1.0985 1.0985
irintensity: 0.0018 0.0072 0.0118 2.1996 1.1454 0.2585 4.3728 0.0178 0.5481 0.0689 9.7368 0.0311 0.1279 1.3717 6.3861 3.0239 1.5259 1.6579 0.7407 2.8634 0.0424 0.7387 3.2717 4.5894 5.1682 1.6667 1.0892 0.2208 11.4474 12.3622 5.2587 0.5908 10.2676 2.2381 6.5040 4.4084 40.4491 1.0076 8.8129 7.3485 2.6540 12.8516 3.7618 33.2176 30.7303 5.1359 14.6805 77.8097 50.6111 14.3926 3.2423 16.4737 11.2667 10.7802 2.4242 9.0749 0.6211 4.7139 7.9220 9.4287 20.3556 29.7131 63.1096 22.2713 20.6006 76.2568 77.7296 0.5483 66.3102 60.9217 22.9338 79.5537 12.0393 4.7873 0.1852 17.7396 18.1280 12.0775 5.8775 0.6011 37.6904 45.3245 21.1483 6.3225 47.6162 4.4363 20.2230 52.9256 61.0016 14.4127 180.5935 207.5495 52.0907 105.6710 0.6131 77.0296 14.7848 27.8442 10.5513 5.0636 7.6115 7.5316 15.1915 3.1381 5.6291 17.6641 0.0830 0.2213
temp: 298.150 k
press: 1.00000 atm
elementType: 16 16 7 7 7 7 7 7 7 7 6 6 6 6 6 6 6 6 6 6 6 6 6 6 1 1 1 1 1 1 1 1 1 1 1 1 1 1
symmnumber: 1
zpe: 728144.9 jmol-1
zpe.correction: 0.277336 hartree
zpe.thermalcorrener: 0.299247 hartree
zpe.thermalcorrenthalpy: 0.300191 hartree
zpe.thermalcorrgfe: 0.221632 hartree
zpe.sumelectzpe: -1774.307612 hartree
zpe.sumelectthermal: -1774.285700 hartree
zpe.sumelectthermalent: -1774.284756 hartree
zpe.sumelectthermalfe: -1774.363316 hartree
dipole: 0.0056 -3.9755 -0.0137
dipole: 3.9756
quadrupole: -160.4456 -115.2438 -162.9537
quadrupole: -0.0431 -10.4106 0.0763
quadrupole: -14.2312 30.9706 -16.7393 -0.0431 -10.4106 0.0763
hfenergy: -1774.5849477 hartree
pointgroup: C01 [X(C14H14N8S2)]
dipole: 0.2566833 1.5428902 -0.0061448 debye
polarizability: 195.4853925|16.6818189|292.999708|-15.608698|2.7429773|222.7187983 unknown
InChI: InChI=1S/C14H14N8S2/c1-23-13-9-11(15-5-17-13)21(7-19-9)3-4-22-8-20-10-12(22)16-6-18-14(10)24-2/h5-8H,3-4H2,1-2H3
charge 0 multiplicity 1
38 atoms
S  3.22521 -3.029848 -0.614594
S  -4.289566 -1.766902 0.356804
N  1.666655 1.769843 -0.327543
N  -1.246566 2.259103 0.057726
N  2.525143 0.086959 -1.641117
N  -2.614905 0.959064 1.373774
N  1.479584 0.552872 1.820246
N  -1.452305 1.029573 -2.081073
N  2.245595 -1.767672 1.633807
N  -2.934798 -0.912253 -1.888187
C  1.135028 3.068914 0.100582
C  -0.320172 3.311957 -0.374157
C  1.788673 0.648418 0.499428
C  -1.721816 1.231611 -0.763548
C  2.327742 -0.384112 -0.329736
C  -2.573438 0.438154 0.066924
C  2.115976 1.366258 -1.597829
C  -1.810976 2.034817 1.326333
C  2.549005 -1.633074 0.310252
C  -3.186387 -0.675181 -0.568091
C  1.736203 -0.692426 2.315735
C  -2.098121 -0.0678 -2.571748
C  3.26469 -4.332135 0.744283
C  -4.741096 -2.994915 -0.996722
H  1.776516 3.880996 -0.287449
H  1.187427 3.082186 1.203218
H  -0.36534 3.338027 -1.476892
H  -0.662029 4.290149 0.0104
H  2.119199 2.042414 -2.450192
H  -1.599488 2.682737 2.174407
H  1.508945 -0.856839 3.372401
H  -1.929905 -0.306174 -3.62536
H  2.248468 -4.5006 1.125682
H  3.916691 -3.996658 1.562175
H  3.664355 -5.238413 0.263501
H  -5.424403 -3.713358 -0.518044
H  -3.833359 -3.493783 -1.362361
H  -5.234635 -2.469508 -1.825538
