program: Gaussian 09
title: 000263980
version: EM64L-G09RevD.01
frameworkgroup: C1[X(C16H22O2)]
method: RPBEPBE
basis: SDD
operation: Freq
keyword: #pfreq=noraman
keyword: PBEPBE/SDD
title: #p freq=noraman PBEPBE/SDD
converged: NO YES NO NO
title: Mulliken charges:
elementType: O O C C C C C C C C C C C C C C C C H H H H H H H H H H H H H H H H H H H H H H
charge: -0.183415 -0.196399 -0.093817 -0.063151 -0.196671 -0.500884 0.210250 -0.480545 -0.582517 -0.532229 0.219340 -0.523324 -0.547423 -0.753168 0.118296 -0.609869 -0.526753 0.170412 0.188449 0.265178 0.231313 0.213886 0.218977 0.232102 0.207244 0.238972 0.253921 0.214689 0.225209 0.243948 0.248993 0.225385 0.235980 0.225966 0.220469 0.214609 0.253173 0.238275 0.249776 0.225354
chargesum: 0.00000
title: Mulliken charges with hydrogens summed into heavy atoms:
elementType: O O C C C C C C C C C C C C C C C C
charge: -0.183415 -0.196399 0.094632 0.202027 0.034641 -0.068021 0.210250 -0.041200 -0.089624 -0.092331 0.219340 -0.030383 -0.086058 -0.092123 0.118296 -0.118422 -0.051623 0.170412
polarizability: 1.80861059e+02 4.11488987e+00 1.50121800e+02 -5.45624600e-01 -5.38702676e+00 1.64887621e+02
1716.lowfreq: -6.2697 -0.0003 0.0006 0.0010 10.9443 11.6407 27.2102 43.3828 58.5743
frequency: 26.8813 43.0785 58.5626 70.9457 95.0415 125.6340 135.5979 151.8837 176.4781 205.1241 239.9907 259.3101 299.1057 303.9057 329.9996 349.7070 388.8104 401.0104 437.5048 457.1485 465.4429 492.4366 500.1996 532.1203 550.8983 567.6058 603.5870 644.6601 667.9492 714.2181 729.4222 767.3685 809.4872 827.2843 841.8007 845.7117 858.4019 891.1178 912.8172 934.4423 949.4039 973.5904 982.7653 985.0634 1004.2269 1030.3538 1039.1203 1046.1206 1083.0933 1085.0068 1094.4471 1123.1297 1128.3972 1135.8092 1147.8171 1157.0332 1165.0059 1171.3231 1181.5080 1191.8183 1199.4882 1206.8284 1223.3691 1241.7114 1251.2119 1255.9147 1277.8513 1284.1541 1286.3244 1295.6321 1308.9425 1309.4471 1315.5938 1336.8972 1339.1850 1348.7409 1362.4117 1367.0459 1387.3851 1423.3147 1425.0039 1430.0004 1440.9346 1460.9568 1464.9382 1471.6111 1476.5491 1477.4903 1487.9996 1636.2841 1660.2963 1697.4019 2934.6485 2938.2128 2944.2730 2952.3170 2959.0111 2966.1840 2974.2131 2976.1259 2977.4287 2981.5903 2985.4532 2986.4128 2999.7511 3003.0650 3018.2701 3044.9250 3063.1885 3068.3877 3068.9011 3074.1852 3078.4144 3078.8017
redmass: 8.5987 3.8773 3.6174 3.6999 2.8157 3.2176 2.9721 2.0754 2.6958 1.1827 2.5757 2.5400 2.6447 2.6229 2.7883 3.0337 2.5112 3.0014 3.0084 2.4984 4.1612 2.9721 3.2841 3.0802 3.7747 3.3705 2.5984 3.7954 2.6753 2.2844 1.9216 2.5795 3.0256 1.8914 2.3082 2.1032 2.3551 2.0445 1.6614 1.7152 1.5806 1.8876 1.9732 2.1226 1.8673 2.2298 1.8278 1.9946 2.5900 2.2618 2.0631 1.5230 1.7647 1.8688 1.4480 2.5404 2.0131 1.3383 1.5914 1.9489 1.6775 1.5823 1.4239 1.4015 1.5478 1.5177 1.3553 1.3585 1.3655 1.2978 1.3797 1.5537 1.4802 1.7388 1.4555 1.4928 1.5900 2.1109 1.2208 1.0771 1.0833 1.0824 1.0911 1.0866 1.0722 1.0859 1.0748 1.0650 1.0664 9.8862 12.0699 7.2456 1.0646 1.0659 1.0804 1.0797 1.0681 1.0718 1.0748 1.0368 1.0635 1.0868 1.0692 1.0656 1.0907 1.0683 1.0941 1.1016 1.0957 1.0957 1.0974 1.0985 1.0984 1.0983
irintensity: 2.5512 3.0705 2.3941 2.3287 3.1335 1.6515 2.0147 1.5869 0.0487 0.4121 0.3558 0.0359 2.6875 0.9521 4.2427 0.9333 4.4442 4.1327 2.4726 2.1761 0.5391 4.8555 1.8302 3.8200 2.4668 6.0231 0.9218 3.2098 2.9546 3.5135 2.3961 2.5771 0.4865 4.2417 0.5009 3.1985 2.2690 1.7629 4.6315 1.1310 15.5622 5.5732 6.4012 0.5039 9.7965 2.3171 2.7376 7.3383 5.4443 13.9973 3.7724 6.3084 2.1093 8.1467 2.6931 72.4929 4.4270 14.1361 0.7439 27.5921 3.2966 1.9811 5.1459 5.0529 7.1187 8.7776 6.4637 5.3423 3.5280 1.9615 3.5292 5.6505 2.8616 3.2306 10.9127 0.7618 4.4022 5.0402 13.6864 11.6176 16.2028 15.3108 17.5868 8.3861 4.5057 9.7680 0.4861 14.7529 16.8593 190.8582 231.9493 0.6493 8.5460 57.2862 13.5308 9.3596 43.6292 3.5576 24.1642 35.6505 15.9616 26.5712 9.3016 38.6879 9.1957 77.7899 28.4596 46.8655 24.5028 7.6161 42.4631 31.6671 7.1923 50.4137
temp: 298.150 k
press: 1.00000 atm
elementType: 8 8 6 6 6 6 6 6 6 6 6 6 6 6 6 6 6 6 1 1 1 1 1 1 1 1 1 1 1 1 1 1 1 1 1 1 1 1 1 1
symmnumber: 1
zpe: 900862.2 jmol-1
zpe.correction: 0.343120 hartree
zpe.thermalcorrener: 0.360237 hartree
zpe.thermalcorrenthalpy: 0.361182 hartree
zpe.thermalcorrgfe: 0.297680 hartree
zpe.sumelectzpe: -771.971205 hartree
zpe.sumelectthermal: -771.954088 hartree
zpe.sumelectthermalent: -771.953143 hartree
zpe.sumelectthermalfe: -772.016645 hartree
dipole: -0.1567 4.4742 1.9872
dipole: 4.8982
quadrupole: -137.5166 -118.2463 -105.9294
quadrupole: -4.4981 12.5198 -4.7414
quadrupole: -16.9525 2.3178 14.6347 -4.4981 12.5198 -4.7414
hfenergy: -772.314325 hartree
pointgroup: C01 [X(C16H22O2)]
dipole: -0.0566239 1.8965274 0.3371326 debye
polarizability: 180.9146834|3.7439315|148.4329426|-1.407834|-1.3009961|166.5228536 unknown
InChI: InChI=1S/C16H22O2/c1-10-15(11-2-4-13(17)8-11)6-3-12-9-14(18)5-7-16(10)12/h10-11,15H,2-9H2,1H3
charge 0 multiplicity 1
40 atoms
O  4.59979 -1.93108 -1.013072
O  -4.356016 -2.146264 0.632102
C  0.984597 1.387168 -0.076511
C  1.813723 0.111753 0.236228
C  -0.115572 1.129194 -1.152181
C  0.323531 1.992544 1.189606
C  -1.328103 0.392947 -0.573009
C  2.92382 0.325327 1.315864
C  2.607589 -0.443436 -0.977145
C  -0.719988 1.033351 1.803576
C  -1.601633 0.355404 0.764646
C  3.899662 -0.857161 1.118392
C  -2.208507 -0.33741 -1.581398
C  -0.538498 2.446269 -1.864614
C  3.815673 -1.184671 -0.38064
C  -2.771391 -0.432606 1.341682
C  -3.660036 -0.540407 -1.076831
C  -3.662634 -1.141985 0.320711
H  1.693477 2.138203 -0.490117
H  1.127934 -0.683605 0.593885
H  0.316777 0.474624 -1.939314
H  -0.174547 2.941707 0.914471
H  1.088504 2.252287 1.944623
H  2.517545 0.37293 2.340523
H  3.445682 1.284043 1.120637
H  2.994932 0.387486 -1.605044
H  2.043106 -1.114056 -1.647266
H  -1.357263 1.58533 2.525374
H  -0.213498 0.248053 2.406958
H  3.561072 -1.754183 1.67657
H  4.942197 -0.664394 1.424298
H  -2.233107 0.218775 -2.538292
H  -1.758982 -1.324858 -1.819476
H  -0.926812 3.185861 -1.142136
H  0.324203 2.896637 -2.390359
H  -1.330768 2.267165 -2.614086
H  -2.417548 -1.190923 2.069621
H  -3.426083 0.245496 1.934693
H  -4.25041 -1.183101 -1.751786
H  -4.152117 0.452687 -1.019282
