program: Gaussian 09
title: 000263979
version: EM64L-G09RevD.01
frameworkgroup: C1[X(C16H22O2)]
method: RPBEPBE
basis: SDD
operation: Freq
keyword: #pfreq=noraman
keyword: PBEPBE/SDD
title: #p freq=noraman PBEPBE/SDD
converged: YES YES NO NO
title: Mulliken charges:
elementType: O O C C C C C C C C C C C C C C C C H H H H H H H H H H H H H H H H H H H H H H
charge: -0.180698 -0.233154 -0.048326 -0.113021 -0.078867 -0.180736 -0.490541 0.552362 -0.629685 -0.485525 -0.574838 -0.503550 -0.786901 -0.522066 0.112138 -0.529023 -0.575461 0.184926 0.191323 0.231998 0.243220 0.210937 0.222370 0.230451 0.234414 0.218078 0.205841 0.236191 0.261465 0.236957 0.221125 0.209447 0.232323 0.228684 0.226279 0.250008 0.247230 0.248974 0.237178 0.258472
chargesum: 0.00000
title: Mulliken charges with hydrogens summed into heavy atoms:
elementType: O O C C C C C C C C C C C C C C C C
charge: -0.180698 -0.233154 0.142997 0.118977 0.164353 0.030201 -0.037720 0.552362 -0.177193 -0.043493 -0.076416 -0.072977 -0.099615 -0.024828 0.112138 -0.042871 -0.316989 0.184926
polarizability: 2.31883642e+02 -3.64270890e+00 1.58175476e+02 9.90831224e+00 1.26157887e+00 1.24656703e+02
1716.lowfreq: -27.1131 -9.0847 -5.0041 -0.0007 -0.0006 -0.0006 34.8801 51.2185 66.9857
frequency: 34.7454 50.9655 66.8630 88.8765 109.0446 119.6879 160.3418 174.9836 193.9114 215.6330 236.5996 255.4079 267.2876 295.9620 349.1453 379.2709 401.3717 420.5229 441.2143 462.4542 473.6739 486.1430 499.7801 563.9811 581.9860 586.5496 620.5655 629.2358 700.7296 732.5344 755.7443 774.2629 808.4979 818.0479 843.7761 856.8448 881.8102 896.3738 912.4635 935.4372 944.2489 953.1005 958.1995 988.7742 998.2301 1011.3612 1036.4245 1069.2998 1073.5814 1080.3407 1097.7784 1110.1042 1114.9158 1137.9364 1147.3335 1157.9943 1158.8534 1177.4347 1179.6344 1206.5123 1214.8817 1222.0646 1240.9868 1252.9669 1255.3359 1265.4387 1279.2986 1283.2800 1289.8111 1304.9169 1305.9606 1313.7777 1320.6869 1322.9218 1336.5923 1350.9254 1358.8526 1361.1649 1380.4563 1396.8958 1426.4647 1429.6532 1444.0811 1459.4625 1468.6668 1469.9238 1475.2910 1481.3620 1494.6351 1584.0980 1641.0475 1662.1606 2911.3753 2921.8314 2955.0375 2963.1729 2967.4408 2973.8797 2982.3111 2984.5693 2985.8086 2987.6374 2988.7431 2991.1584 3034.0093 3041.8834 3048.4386 3062.8971 3064.9887 3068.1929 3070.8190 3075.9927 3081.5781 3122.3203
redmass: 6.8734 4.6134 4.2754 3.6800 2.9358 2.7868 2.5856 2.2118 3.6671 2.3657 2.4127 1.6680 2.5962 2.3255 3.7579 2.7704 2.2934 3.0121 3.0596 2.5601 3.4964 3.6531 3.4685 3.6283 3.2975 2.2073 3.1448 3.7644 2.4367 1.9057 2.6471 2.3231 3.0580 2.7332 2.2351 2.2875 2.1980 1.3740 1.6105 2.3847 1.3983 2.3281 2.0070 1.9830 1.9905 1.6653 2.0649 2.3188 2.5367 1.9925 1.8322 1.3331 2.1901 2.1801 1.4342 1.8662 2.4111 1.5334 2.0014 1.2790 1.6833 1.4887 1.4333 1.3189 1.4599 1.8634 1.3688 1.1971 1.2934 1.3320 1.3534 1.4709 1.4104 1.4088 1.4637 1.7232 1.4703 1.4515 1.8071 1.2267 1.0843 1.0828 1.0789 1.0958 1.0806 1.0861 1.0872 1.0531 1.0514 9.7220 7.6571 12.0824 1.0815 1.0804 1.0656 1.0713 1.0823 1.0772 1.0481 1.0611 1.0554 1.0659 1.0634 1.0634 1.1002 1.0964 1.0999 1.0980 1.0942 1.0945 1.0982 1.0998 1.0989 1.0916
irintensity: 7.0687 1.4049 0.5540 2.0618 1.5518 2.6868 0.2679 1.5910 1.4537 0.3915 0.7749 0.1930 0.8887 0.3874 3.6834 1.5217 4.0918 0.3239 2.2201 0.4496 0.3404 8.6148 9.6208 6.3289 0.4270 0.9695 0.6643 0.0732 0.9028 3.0567 1.4555 6.2626 0.8179 1.0255 5.6357 2.3573 4.1310 26.6826 0.6086 5.9853 1.0851 5.5183 10.3177 2.6935 15.6815 2.2735 9.2706 29.3073 0.2617 3.5431 2.9750 3.4284 18.0823 2.8576 1.0805 16.0917 71.5772 5.7916 12.1548 5.5017 7.1747 4.0067 6.1412 4.1681 2.8858 64.5335 1.6896 2.6885 5.7576 3.3385 1.6756 1.5151 1.9214 7.2872 2.6543 12.5612 1.4945 0.1469 3.4682 22.5235 21.6388 12.3434 10.2062 13.4398 1.3446 17.3826 5.9736 7.5777 9.7885 201.1181 160.3079 231.6663 10.6984 29.2825 26.8250 2.4368 13.1672 30.2556 10.5240 61.7168 11.0504 6.3379 63.3540 19.7688 29.2458 42.2346 36.6794 43.6913 19.5631 4.7788 34.4893 30.2937 25.5288 8.9969
temp: 298.150 k
press: 1.00000 atm
elementType: 8 8 6 6 6 6 6 6 6 6 6 6 6 6 6 6 6 6 1 1 1 1 1 1 1 1 1 1 1 1 1 1 1 1 1 1 1 1 1 1
symmnumber: 1
zpe: 903557.0 jmol-1
zpe.correction: 0.344147 hartree
zpe.thermalcorrener: 0.360921 hartree
zpe.thermalcorrenthalpy: 0.361865 hartree
zpe.thermalcorrgfe: 0.299795 hartree
zpe.sumelectzpe: -771.971527 hartree
zpe.sumelectthermal: -771.954753 hartree
zpe.sumelectthermalent: -771.953808 hartree
zpe.sumelectthermalfe: -772.015879 hartree
dipole: -2.4298 2.2398 -1.2328
dipole: 3.5271
quadrupole: -165.3458 -106.8290 -105.8716
quadrupole: -16.3231 -7.9767 0.2467
quadrupole: -39.3303 19.1865 20.1438 -16.3231 -7.9767 0.2467
hfenergy: -772.3156737 hartree
pointgroup: C01 [X(C16H22O2)]
dipole: 0.9451857 -0.8932729 -0.4840264 debye
polarizability: 231.7668416|-4.5134533|158.263314|-10.0369677|-1.2216251|124.6856648 unknown
InChI: InChI=1S/C16H22O2/c1-10-15(11-2-4-13(17)8-11)6-3-12-9-14(18)5-7-16(10)12/h9-11,15-16H,2-8H2,1H3
charge 0 multiplicity 1
40 atoms
O  5.369761 1.593994 -0.068765
O  -5.393572 0.148594 0.73584
C  0.849977 -0.529158 -0.298025
C  -0.11789 0.693878 -0.146069
C  2.247486 -0.287273 0.327715
C  -1.450805 0.375587 -0.919625
C  0.193179 -1.832034 0.231492
C  -2.078165 -0.900626 -0.377492
C  -1.17778 -2.116465 -0.44854
C  3.289815 -1.41261 0.022637
C  2.959368 0.995463 -0.178127
C  -2.461822 1.54937 -1.040949
C  -0.355461 1.120062 1.321862
C  4.664342 -0.761916 0.30434
C  4.461989 0.733108 0.007729
C  -3.540215 1.60249 0.068403
C  -3.341491 -0.949795 0.150599
C  -4.195283 0.24343 0.326943
H  1.011152 -0.66423 -1.39374
H  0.346253 1.553503 -0.673419
H  2.141958 -0.218394 1.430608
H  -1.114543 0.134125 -1.953966
H  0.051688 -1.759866 1.328222
H  0.863667 -2.693007 0.051897
H  -1.661663 -2.995128 0.015199
H  -0.989122 -2.368108 -1.514256
H  3.216475 -1.702797 -1.044975
H  3.123967 -2.320759 0.625983
H  2.661116 1.932313 0.322323
H  2.775766 1.138483 -1.26499
H  -2.984972 1.449202 -2.011894
H  -1.913271 2.510802 -1.079256
H  -0.909522 0.353424 1.893177
H  0.599052 1.310101 1.84499
H  -0.935956 2.057997 1.367573
H  5.505259 -1.170021 -0.282309
H  4.944721 -0.856994 1.373298
H  -4.334143 2.328046 -0.183083
H  -3.103209 1.933964 1.030966
H  -3.772107 -1.900354 0.491683
