program: Gaussian 09
title: 000263972
version: EM64L-G09RevD.01
frameworkgroup: C1[X(C5H8FN3O2S)]
method: RPBEPBE
basis: SDD
operation: Freq
keyword: #p
keyword: freq=noraman
keyword: PBEPBE/SDD
title: #p freq=noraman PBEPBE/SDD
converged: YES YES NO NO
title: Mulliken charges:
elementType: S F O O N N N C C C C C H H H H H H H H
charge: 0.201327 -0.240193 -0.434594 -0.240534 -0.022088 -0.064428 -0.558553 0.047572 -0.283098 -0.135646 0.160362 -0.814940 0.226940 0.228251 0.338992 0.245859 0.269386 0.347344 0.342423 0.385618
chargesum: 0.00000
title: Mulliken charges with hydrogens summed into heavy atoms:
elementType: S F O O N N N C C C C C
charge: 0.201327 -0.240193 -0.048976 -0.240534 -0.022088 -0.064428 0.131214 0.047572 0.172093 -0.135646 0.160362 0.039297
polarizability: 1.84404351e+02 -1.04326903e+01 1.16587872e+02 -1.78104509e-01 -8.22331263e+00 5.66994731e+01
1716.lowfreq: -4.0467 0.0006 0.0016 0.0016 1.9127 8.4930 29.2988 37.6724 64.1170
frequency: 29.2940 37.6352 64.1028 76.4795 79.9829 106.5457 155.2255 194.5975 230.2202 248.0010 265.0176 326.8824 336.7523 405.5208 465.4981 490.4783 520.4200 539.5674 556.2409 588.7559 619.8465 629.3680 644.6663 654.7960 737.0415 802.3629 896.9841 956.3359 979.0401 989.3157 1001.9269 1049.3667 1162.7616 1179.8213 1224.8996 1292.2978 1339.6675 1349.3090 1364.5592 1432.0042 1443.8253 1456.5117 1470.6579 1550.2319 1610.4514 1642.3914 3023.4071 3058.4243 3135.7975 3143.5491 3183.4585 3525.5354 3534.1725 3682.0654
redmass: 9.1610 5.5346 6.8704 7.7220 5.1892 6.0924 1.4386 5.1651 2.6107 4.6251 3.2598 6.2415 3.9767 5.4106 5.0603 1.2109 4.1261 1.5981 2.8939 3.0033 2.7109 2.7373 4.5614 4.9882 9.9852 4.0983 9.2100 3.7196 1.1969 1.9422 1.2362 2.6559 1.5075 3.7113 1.3764 3.0448 3.3938 1.2616 1.2213 1.0646 1.0991 1.7678 1.8781 3.9509 1.4422 8.8464 1.0292 1.0555 1.1110 1.1035 1.1065 1.0451 1.0642 1.1046
irintensity: 2.1542 1.5919 0.8079 0.7679 3.1240 10.9529 0.9108 3.8801 0.4713 3.1642 0.8280 5.9945 1.4152 8.5234 3.0997 47.6580 4.1393 213.9864 59.9019 88.1228 9.6415 75.1861 65.6282 80.1092 7.9026 33.3201 85.3443 78.5568 7.8655 200.7511 7.8708 373.2232 22.9007 63.3455 7.7012 198.4598 43.2284 28.1877 13.2431 36.2907 26.5691 342.9390 458.0172 24.4375 324.9956 180.3104 22.1843 29.4729 4.3641 9.3776 1.8080 160.8502 51.1049 51.2693
temp: 298.150 k
press: 1.00000 atm
elementType: 16 9 8 8 7 7 7 6 6 6 6 6 1 1 1 1 1 1 1 1
symmnumber: 1
zpe: 367756.4 jmol-1
zpe.correction: 0.140071 hartree
zpe.thermalcorrener: 0.153816 hartree
zpe.thermalcorrenthalpy: 0.154760 hartree
zpe.thermalcorrgfe: 0.097600 hartree
zpe.sumelectzpe: -1006.968761 hartree
zpe.sumelectthermal: -1006.955016 hartree
zpe.sumelectthermalent: -1006.954072 hartree
zpe.sumelectthermalfe: -1007.011231 hartree
dipole: -3.3580 1.6891 -1.1247
dipole: 3.9236
quadrupole: -60.7070 -72.7126 -78.9585
quadrupole: -12.3146 -6.9025 -7.1755
quadrupole: 10.0857 -1.9199 -8.1658 -12.3146 -6.9025 -7.1755
hfenergy: -1007.1088316 hartree
pointgroup: C01 [X(C5H8F1N3O2S1)]
dipole: 1.2605695 0.885181 0.1012637 debye
dipolederiv: -0.2864298 0.2213578 0.061005 0.2909399 -0.4863658 0.0318907 -0.1331241 0.1575084 -0.0502231 -0.4534312 0.0684743 -0.1162438 0.1348414 -0.3034687 -0.0450355 -0.4538835 0.0883594 -0.6109172 -1.5665547 0.0250506 0.2154278 -0.0132774 -0.2683249 -0.0378847 0.2587249 -0.0456026 -0.4617954 -0.6023524 0.058127 0.0585153 -0.1337172 -1.0190318 0.1939036 0.132067 0.1946115 -0.384432 1.1618041 0.416352 -0.2411319 0.8953885 0.0255283 -0.0915783 -0.4328133 -0.1038712 -0.0415521 -2.0989313 -0.3300207 0.2498521 -0.4309533 -0.6077962 0.1306296 0.2425385 0.1805717 -0.2571583 -1.0527829 -0.4705832 0.096888 -0.8812426 -1.0476061 0.1555838 0.1291084 0.1131682 -0.6572864 -0.980749 -0.4041089 0.2382343 -0.2655753 -0.1455568 0.0437661 0.346259 0.0054043 -0.102001 0.4907056 -0.0389406 0.107546 -0.3407555 0.2831502 0.1012017 0.410533 0.0066442 0.7104911 2.4935784 0.2688673 -0.3038943 -0.110176 1.2979772 -0.2818175 -0.0004454 -0.3497065 0.168438 1.8965747 0.0980929 -0.3700303 0.6708474 1.2921043 -0.3568478 -0.5521849 -0.3111591 0.3948289 -0.0495431 0.0791617 0.0033911 0.0075252 0.2386758 0.0897724 0.0470023 0.0159169 0.0374433 0.0847041 -0.1366188 -0.0386365 -0.0406999 -0.0357764 -0.0230661 -0.0394756 0.0286475 0.0215167 -0.0601152 0.0587923 0.0697716 0.0156753 0.1344909 -0.0139482 0.0034539 -0.028658 -0.0217417 0.089452 -0.1036429 0.037444 -0.0681599 0.0832686 -0.0181511 0.0276162 -0.0154816 0.0559107 -0.0033461 0.0912595 -0.0047983 0.1055652 -0.0596856 -0.0226045 0.0079785 -0.0363845 0.1275226 0.0785244 -0.0662566 -0.0892705 -0.009135 0.0092546 0.0258365 -0.0550967 -0.0014787 -0.0557076 0.3021304 0.1101814 0.0046916 0.0660775 0.2330679 0.0283168 0.0592826 0.0264868 0.3566881 0.1480615 0.02012 0.0298272 0.1286195 0.2576148 0.0116649 0.0172882 0.01855 0.3863564 0.4087003 0.0343347 -0.0085883 -0.0217876 0.1184797 0.0783675 -0.014829 0.0564733 0.3836192 unknown
polarizability: 180.9902878|14.6451812|117.5052887|-12.3023681|-13.5037246|59.1961198 unknown
InChI: InChI=1S/C5H8FN3O2S/c1-12-5(7)9-8-3(2-6)4(10)11/h10H,2,7H2,1H3
charge 0 multiplicity 1
20 atoms
S  3.672179 -0.475723 0.465304
F  -1.933372 1.173405 -1.275106
O  -2.763052 -0.824119 1.270653
O  -0.891705 -2.205513 1.241492
N  0.621374 0.048514 0.529437
N  1.315462 1.154995 0.062293
N  3.408863 2.093845 -0.238094
C  -0.702679 0.154158 0.560493
C  -1.493568 1.361135 0.125067
C  2.645227 0.994618 0.056361
C  -1.395667 -1.07471 1.043351
C  2.661936 -1.977191 -0.095071
H  -0.861053 2.262681 0.13296
H  -2.410075 1.479207 0.721989
H  1.83736 -2.154027 0.60414
H  3.392013 -2.802621 -0.107559
H  2.272791 -1.799093 -1.107448
H  4.407649 2.009842 -0.414393
H  2.939552 2.993293 -0.344482
H  -3.195933 -1.670294 1.563315
