program: Gaussian 09
title: 000024368
version: EM64L-G09RevD.01
frameworkgroup: C1[X(C8H12Cl2N2O)]
method: RPBEPBE
basis: SDD
operation: Freq
keyword: #p
keyword: freq=noraman
keyword: PBEPBE/SDD
title: #p freq=noraman PBEPBE/SDD
converged: YES YES NO NO
title: Mulliken charges:
elementType: Cl Cl O N N C C C C C C C C H H H H H H H H H H H H
charge: -0.087133 -0.097789 -0.268421 -0.371821 -0.504297 -0.180794 -0.502409 -0.486151 0.212616 0.147376 0.161463 -0.609878 -0.602305 0.259468 0.249197 0.259205 0.235607 0.267083 0.330041 0.250474 0.237093 0.250566 0.239056 0.306597 0.305157
chargesum: 0.00000
title: Mulliken charges with hydrogens summed into heavy atoms:
elementType: Cl Cl O N N C C C C C C C C
charge: -0.087133 -0.097789 -0.268421 -0.041780 0.107457 0.078674 0.005993 0.016539 0.212616 0.147376 0.161463 -0.122311 -0.112683
polarizability: 1.35251349e+02 3.45138186e+00 9.97136967e+01 3.96338312e+00 -1.09535831e+01 1.25149140e+02
1716.lowfreq: -13.9911 -7.4772 -0.0020 0.0002 0.0020 6.4556 21.7070 34.2294 41.8273
frequency: 20.9825 34.0225 41.8210 57.8390 68.7672 91.3245 121.3268 139.0966 160.4258 198.8103 224.7668 282.6000 295.4262 351.5861 359.2964 369.1729 385.2134 432.3773 522.2714 547.3059 561.3002 581.7816 596.3002 676.6483 685.0382 708.4634 729.1153 768.5425 853.9921 893.3963 919.2812 923.0814 923.1990 940.1745 994.3728 1035.4435 1063.6942 1104.7907 1116.2804 1151.9725 1197.0469 1216.5616 1250.0190 1283.4565 1292.7629 1295.8478 1312.3488 1356.8138 1405.9840 1407.0878 1444.1142 1448.1887 1449.6050 1615.4521 1660.5762 1663.3436 1676.9688 2991.1154 2994.8290 3019.1177 3057.0984 3064.4084 3110.4246 3111.5572 3225.2201 3226.2082 3394.1638 3511.8495 3527.2996
redmass: 7.5429 6.8298 8.2993 5.1442 4.3113 5.3575 5.1885 1.2102 3.0517 5.2192 4.3091 3.6659 4.7556 2.8212 2.5808 3.1544 3.1276 4.6256 4.4449 5.0727 4.6706 1.6959 2.0117 1.2619 1.0869 2.2023 3.7565 1.6562 2.1766 2.4465 1.6402 1.4932 1.4069 1.8714 2.5290 3.1095 3.3150 1.7938 2.2258 2.7144 1.4893 1.4447 1.8354 1.1641 1.2321 1.3747 1.2987 1.5564 1.1494 1.1489 1.1538 1.1022 1.5846 6.6151 6.2445 5.7854 1.0818 1.0589 1.0608 1.0839 1.1018 1.0995 1.0634 1.0635 1.1144 1.1145 1.0428 1.0988 1.0799
irintensity: 1.7765 3.5708 1.2213 2.5625 1.0235 0.7240 1.3405 28.8706 0.7523 1.8467 4.3846 8.0461 22.6945 2.8814 2.7798 8.4735 6.2723 5.1485 10.3017 28.1026 15.5241 164.9842 41.9223 3.1438 0.1115 4.1634 5.0687 131.2414 2.0991 11.8579 30.7076 84.9237 54.3361 7.4200 2.5348 2.2146 2.4004 9.5754 13.9937 112.4415 2.7918 10.4888 41.6436 1.4100 5.7417 14.1818 2.1119 10.1966 6.8999 3.3642 5.3982 19.0787 144.6439 156.2768 58.4342 60.2053 20.1662 7.7535 9.4002 3.7749 3.8669 10.2997 1.1427 1.1745 2.9929 2.4199 0.2663 2.0666 33.7461
temp: 298.150 k
press: 1.00000 atm
elementType: 17 17 8 7 7 6 6 6 6 6 6 6 6 1 1 1 1 1 1 1 1 1 1 1 1
symmnumber: 1
zpe: 503273.6 jmol-1
zpe.correction: 0.191687 hartree
zpe.thermalcorrener: 0.207174 hartree
zpe.thermalcorrenthalpy: 0.208118 hartree
zpe.thermalcorrgfe: 0.146027 hartree
zpe.sumelectzpe: -1415.834141 hartree
zpe.sumelectthermal: -1415.818654 hartree
zpe.sumelectthermalent: -1415.817709 hartree
zpe.sumelectthermalfe: -1415.879801 hartree
dipole: -0.1940 -0.3054 1.4740
dipole: 1.5177
quadrupole: -89.6841 -96.8087 -89.1563
quadrupole: -0.8084 2.5533 5.8554
quadrupole: 2.1990 -4.9257 2.7267 -0.8084 2.5533 5.8554
hfenergy: -1416.0258278 hartree
pointgroup: C01 [X(C8H12Cl2N2O1)]
dipole: -0.1106655 0.1174231 0.574915 debye
dipolederiv: -0.2660589 -0.0571674 0.1559408 -0.081743 -0.1306323 0.0441164 0.1444878 0.0185003 -0.6678242 -0.199531 0.0588633 -0.0115502 0.0509583 -0.180931 0.064709 0.033682 0.0528627 -0.6936913 -0.5440366 -0.1831982 0.0816376 -0.0608046 -0.496828 0.2073681 -0.1827401 0.0902858 -0.8479397 -0.3660252 0.0788912 -0.2034195 0.0584397 -0.3391865 -0.215185 -0.3639856 -0.2828779 -0.5484041 -0.2654211 -0.1064956 -0.1656312 -0.0470345 -0.0758166 0.0150277 -0.2440058 -0.0336022 -0.3544699 -0.0994503 -0.1458214 -0.0114064 -0.2042407 -0.058216 0.018588 -0.0483042 0.0874799 0.0560855 0.0273817 -0.0796897 0.0093942 -0.1328342 0.0076295 0.0132108 0.1327406 0.0260642 -0.1006964 -0.1371722 0.0579664 -0.0070481 0.0751461 0.0883232 -0.0063508 -0.0117993 0.0756466 -0.1060976 0.6845435 0.4417004 0.2573909 0.3491317 0.4769487 -0.0822214 0.4599913 -0.0493055 1.1489566 0.3721435 0.2357546 -0.1317986 0.3869931 0.0763334 0.0300239 -0.2725067 0.020215 1.0317058 0.4122524 -0.2949401 -0.0828964 -0.1811365 0.0306229 -0.079251 -0.0359246 -0.1503896 1.0322307 -0.3427936 0.0827842 -0.1191359 0.0433119 -0.3244096 -0.0691042 -0.0863621 -0.0625034 -0.3034666 -0.3272912 0.0251312 0.1042758 -0.0063858 -0.3772118 -0.0703601 0.0995194 -0.0632119 -0.2344814 0.0872973 -0.0230092 0.0009442 -0.0060579 0.0556935 -0.0009174 0.0079373 -0.0137339 -0.0739495 0.0127389 0.0267166 -0.0189212 0.0249303 -0.0751189 -0.0524821 0.0136733 -0.0688803 0.0757778 0.0647451 -0.0056028 0.0522306 -0.020948 0.1060334 -0.0068136 -0.0246072 0.0103556 -0.0539721 0.0631584 0.0418832 -0.0150434 0.0292198 0.0677546 0.0428347 -0.0011906 -0.0183594 -0.0855372 0.0019075 -0.062362 0.0250984 -0.0925327 -0.0122248 0.0020649 0.0073509 0.0240606 0.0815321 0.1386592 -0.1097893 -0.0047892 -0.0933095 0.3041673 0.1006928 0.0486473 0.0928933 0.205512 0.0464616 -0.1016292 0.0326194 -0.1296366 0.1433404 0.0082749 0.0368748 0.016126 0.0956241 0.1232232 -0.0496498 0.0494706 -0.0422742 0.1555903 0.0061498 0.0718173 0.0147987 -0.0482599 0.0410309 0.0931457 -0.0455193 0.0705995 0.1724474 0.0359251 -0.0528276 0.0429981 0.0711962 0.1143999 0.0240464 0.0087159 0.0266411 0.1752908 0.026157 -0.0106315 0.0373966 -0.0554156 0.2281386 -0.0247015 0.0327019 -0.0437117 0.1235811 -0.0816624 0.180385 -0.0480327 0.1088194 0.1296985 0.077173 0.0067389 0.0272787 0.086819 0.049205 0.0977781 0.1812136 0.2667654 unknown
polarizability: 134.5282144|6.3455628|96.2353868|2.4512721|2.2411106|129.3505843 unknown
InChI: InChI=1S/C8H12Cl2N2O/c1-5(9)3-7(4-6(2)10)8(13)12-11/h7,12H,1-4,11H2
charge 0 multiplicity 1
25 atoms
Cl 3.35983 0.034117 -1.455036
Cl -1.091116 1.850736 -2.050332
O  -1.020675 -1.741543 1.40105
N  -1.655389 -1.59882 -0.832043
N  -2.849192 -2.355107 -0.676374
C  0.367172 -0.379069 -0.117618
C  1.652213 -0.954704 0.545947
C  0.070559 1.065466 0.390928
C  -0.813425 -1.300418 0.228442
C  2.892777 -0.128598 0.330268
C  -1.164211 1.693999 -0.201205
C  3.680327 0.460962 1.254546
C  -2.265273 2.146863 0.432866
H  0.513727 -0.340398 -1.213571
H  1.821284 -1.975117 0.150111
H  1.47172 -1.056718 1.631824
H  -0.053591 1.036873 1.490225
H  0.95145 1.697308 0.166992
H  -1.53817 -1.142126 -1.739745
H  4.579892 1.022804 0.990944
H  3.421556 0.374385 2.315859
H  -3.104525 2.60519 -0.095997
H  -2.333002 2.054966 1.522647
H  -3.421534 -1.96383 0.086126
H  -2.625005 -3.34162 -0.485153
