program: Gaussian 09
title: 000263955
version: EM64L-G09RevD.01
frameworkgroup: C1[X(C11H11NO)]
method: RPBEPBE
basis: SDD
operation: Freq
keyword: #p
keyword: freq=noraman
keyword: PBEPBE/SDD
title: #p freq=noraman PBEPBE/SDD
converged: NO NO NO NO
title: Mulliken charges:
elementType: O N C C C C C C C C C C C H H H H H H H H H H H
charge: -0.348294 0.037693 0.215254 0.226668 0.327916 0.346951 -0.451853 -0.449651 -0.377615 -0.293052 -0.830550 -0.833329 -0.267704 0.233601 0.233865 0.293584 0.244709 0.237889 0.234292 0.234290 0.232705 0.238660 0.232691 0.281279
chargesum: 0.00000
title: Mulliken charges with hydrogens summed into heavy atoms:
elementType: O N C C C C C C C C C C C
charge: -0.348294 0.037693 0.215254 0.226668 0.327916 0.346951 -0.218252 -0.215786 -0.084031 -0.048343 -0.124079 -0.129272 0.013576
polarizability: 2.04289631e+02 -6.42089250e+00 1.52716785e+02 -1.05049553e-02 -7.87784655e-03 5.99745843e+01
1716.lowfreq: -13.0552 -0.0002 0.0005 0.0006 3.8918 11.9035 98.7372 123.4064 163.2444
frequency: 98.7330 123.4012 163.2440 172.3532 191.2924 220.8178 275.7554 284.1634 338.1998 394.1177 423.4837 442.6560 464.9634 509.2269 518.0050 544.8633 580.6091 653.6055 707.3399 713.5428 732.3982 767.5060 820.4753 834.5850 855.3311 922.4320 944.0140 948.0777 950.3185 1001.2355 1045.1365 1047.7019 1057.5451 1073.4403 1145.4832 1163.6731 1203.0413 1246.2783 1269.3936 1275.8809 1313.1433 1376.2895 1395.4694 1400.2174 1406.2461 1413.3451 1467.7010 1471.2936 1472.4618 1473.6596 1479.6318 1487.1767 1578.4064 1598.2299 1631.2150 2971.1532 2972.9611 3044.9499 3047.7150 3088.5157 3088.8173 3121.2092 3144.0898 3164.1449 3207.6752 3212.9631
redmass: 4.9951 2.8064 2.6908 1.1099 1.1272 4.1629 4.7509 2.7963 3.2975 6.1583 3.0632 5.2341 4.7899 4.3360 3.1133 4.6821 3.2260 3.7559 5.8616 5.0616 5.6397 2.8210 1.5514 1.2824 1.5704 3.7852 1.9617 1.3383 1.3361 1.6474 1.5519 1.5436 3.0949 1.8835 1.5839 1.6479 3.1792 2.0821 1.9257 1.8295 3.3482 2.1425 1.3950 1.3482 3.1566 3.1276 2.8027 1.0449 1.0458 1.6538 1.7885 1.2614 6.3692 5.3814 6.6071 1.0380 1.0379 1.0973 1.0975 1.0979 1.0978 1.0877 1.0959 1.0896 1.0918 1.0973
irintensity: 3.0924 0.9441 0.8751 0.0021 1.1956 0.8642 8.5700 1.4366 0.8017 1.8248 6.0751 1.7202 4.0232 1.5179 1.8308 3.1592 0.0174 4.0648 5.4005 10.2547 2.9925 0.6050 16.7563 40.7207 51.2234 3.5739 2.5052 0.0807 0.0233 4.2504 4.7806 7.3242 16.9896 2.6383 6.9049 1.6793 97.4749 6.3704 20.2481 11.4991 15.7464 20.0774 9.0179 26.6604 35.0193 4.5612 21.6638 12.2005 17.9326 5.8416 1.6213 21.9440 13.6686 12.6378 37.5103 35.9595 26.3665 18.4811 19.2504 3.0316 31.3027 14.6745 27.8967 6.2394 0.5036 0.8482
temp: 298.150 k
press: 1.00000 atm
elementType: 8 7 6 6 6 6 6 6 6 6 6 6 6 1 1 1 1 1 1 1 1 1 1 1
symmnumber: 1
zpe: 503346.7 jmol-1
zpe.correction: 0.191715 hartree
zpe.thermalcorrener: 0.202757 hartree
zpe.thermalcorrenthalpy: 0.203701 hartree
zpe.thermalcorrgfe: 0.155506 hartree
zpe.sumelectzpe: -554.788327 hartree
zpe.sumelectthermal: -554.777285 hartree
zpe.sumelectthermalent: -554.776341 hartree
zpe.sumelectthermalfe: -554.824536 hartree
dipole: -4.6742 -0.6283 0.0006
dipole: 4.7163
quadrupole: -89.7705 -62.0875 -79.9800
quadrupole: -0.7907 0.0009 -0.0017
quadrupole: -12.4911 15.1918 -2.7007 -0.7907 0.0009 -0.0017
hfenergy: -554.9800421 hartree
pointgroup: C01 [X(C11H11N1O1)]
dipole: -1.8094931 -0.4107231 0.0002324 debye
dipolederiv: -1.3513882 0.0016836 0.0000761 -0.2740705 -0.323145 0.00002 0.000102 -0.0000017 -0.330837 1.3025133 0.1244316 -0.0001082 0.2253125 0.1120293 -0.0000202 -0.0001246 -0.0000105 0.096184 0.3396341 0.0525094 -0.000033 -0.1590825 -0.1458164 0.0000279 -0.0000176 0.0000132 0.0243005 -0.1149755 -0.0666009 0.0000224 0.056609 -0.2590056 0.0000173 0.0000097 0.0000344 -0.0055191 -0.1874702 0.0760009 0.0000067 0.0757566 0.3323094 -0.0000315 0.0000004 -0.0000303 -0.0439703 0.1188204 0.0337363 -0.0000196 0.2017476 0.3197587 -0.0000654 -0.000063 -0.0001247 -0.033723 0.0630384 -0.1276525 -0.0000078 -0.0536111 0.064392 -0.0000121 -0.0000137 0.0000018 -0.1550501 -0.0167138 0.127999 -0.0000204 0.0030442 -0.1876751 0.0000086 0.0000052 -0.0000003 -0.1728453 -0.377047 -0.0534251 0.0000263 0.3383766 0.0441721 -0.0000427 -0.000011 -0.0000147 -0.142864 0.1999429 -0.0544023 -0.000016 -0.0404801 0.0947724 -0.000028 -0.0000173 -0.000021 -0.0993345 0.0343293 -0.1008119 0.0000108 -0.0644861 -0.0930882 0.0000178 0.0000107 0.0000147 0.0725228 0.0642725 0.0011396 0.0000032 -0.0599865 -0.1267628 0.0000407 0.0000446 0.0001198 0.0705122 -0.154746 -0.0555307 0.0000154 -0.2945921 0.0540774 -0.0000006 0.0000415 -0.000019 -0.1352772 -0.0123062 0.1036433 0.0000028 0.1249825 -0.0436786 0.0000049 -0.0000005 0.000005 0.1485757 -0.1155608 -0.0606768 0.0000196 -0.0767683 0.0594551 0.0000077 0.0000103 0.0000048 0.1537138 0.0596001 -0.0262582 0.0000097 -0.0175831 0.0218131 0.000016 0.000014 0.0000169 0.1682803 0.1103164 -0.056243 0.0000081 -0.0096627 -0.0654069 0.0000259 0.0000059 0.0000272 0.1366596 -0.0752243 0.1742014 -0.0000035 0.0550071 0.0055739 0.0000055 0.0000074 -0.0000027 0.1089918 0.0428094 -0.0798659 -0.1110225 -0.0172196 0.0184651 -0.0093372 -0.0828402 -0.0715209 -0.0382065 0.0428294 -0.0798389 0.111027 -0.0172062 0.018481 0.00933 0.0828334 0.0715217 -0.038241 0.0713013 0.0489461 -0.0904613 -0.0138993 -0.0245709 0.0679186 -0.0419192 0.1101377 -0.0404426 -0.1532201 -0.081403 -0.0000397 0.0413741 0.0868262 0.0000086 -0.0000467 -0.0000158 0.1097598 0.0712448 0.0490503 0.0905014 -0.0138349 -0.0246055 -0.0679278 0.0419581 -0.1101483 -0.0403054 0.0379998 0.0493676 0.0000024 -0.0097275 0.0616292 0.0000161 0.0000107 0.0000129 0.1871156 unknown
polarizability: 205.0211142|-1.7228253|151.985302|-0.0097581|-0.008786|59.9745843 unknown
InChI: InChI=1S/C11H11NO/c1-8-3-4-9(2)11-7-12(13)6-5-10(8)11/h3-7H,1-2H3
charge 0 multiplicity 1
24 atoms
O  3.742616 0.307622 -0.000055
N  2.449139 -0.014766 0.000078
C  0.077999 0.61213 0.000178
C  -0.312164 -0.785931 0.000326
C  -0.933896 1.646019 0.00017
C  -1.700976 -1.158888 0.000438
C  -2.274782 1.24434 0.000295
C  -2.65573 -0.132333 0.000418
C  1.460245 0.945015 0.00005
C  0.749436 -1.753808 0.000375
C  -0.557126 3.115081 0.000033
C  -2.124105 -2.616952 0.000652
C  2.078804 -1.378311 0.00026
H  -3.059365 2.010372 0.000296
H  -3.721428 -0.3890 0.000487
H  1.838607 1.96718 -0.000081
H  0.521079 -2.823276 0.000522
H  -1.460048 3.747982 0.000035
H  0.043539 3.38461 0.890104
H  0.043438 3.38447 -0.890148
H  -1.745684 -3.153898 0.891461
H  -3.223339 -2.702722 0.00044
H  -1.745311 -3.15433 -0.889729
H  2.930051 -2.059807 0.000295
