program: Gaussian 09
title: 000263904
version: EM64L-G09RevD.01
frameworkgroup: C1[X(C18H26O2)]
method: RPBEPBE
basis: SDD
operation: Freq
keyword: #pfreq=noraman
keyword: PBEPBE/SDD
title: #p freq=noraman PBEPBE/SDD
converged: YES YES NO NO
title: Mulliken charges:
elementType: O O C C C C C C C C C C C C C C C C C C H H H H H H H H H H H H H H H H H H H H H H H H H H
charge: -0.447171 -0.273054 -0.095445 0.195457 0.344823 -0.479340 -0.527887 -0.550299 -0.416030 0.302730 -0.776232 -0.580203 -0.444101 -0.774389 0.285841 -0.568760 -0.374567 0.306337 -0.405381 -0.535754 0.180209 0.202740 0.194881 0.199120 0.214768 0.214944 0.222924 0.194408 0.220477 0.212302 0.232467 0.223043 0.224464 0.226851 0.211362 0.237597 0.207573 0.204526 0.243854 0.256528 0.231375 0.336591 0.240232 0.218660 0.242603 0.218923
chargesum: 0.00000
title: Mulliken charges with hydrogens summed into heavy atoms:
elementType: O O C C C C C C C C C C C C C C C C C C
charge: -0.110580 -0.273054 0.084764 0.195457 0.344823 -0.081719 -0.113999 -0.112431 -0.001145 0.302730 -0.108419 -0.128887 0.004858 -0.118436 0.285841 -0.312232 -0.143192 0.306337 -0.165149 0.144432
polarizability: 2.35344103e+02 1.02649866e+01 1.85649713e+02 1.34463282e+01 -9.70385747e+00 1.61922671e+02
1716.lowfreq: -10.6630 -0.0006 -0.0001 0.0001 10.0771 20.1607 36.7119 61.6747 80.3455
frequency: 36.3111 61.3982 80.2732 86.2714 97.6687 158.9619 167.1249 186.1009 197.1743 210.2581 224.9737 230.6284 249.2699 267.0871 278.0079 285.2994 297.7022 313.7208 334.9993 342.6120 350.9521 375.6161 391.1706 411.8071 432.3063 444.0254 469.3454 500.3193 509.4640 537.3584 548.3416 565.8064 625.2987 643.5159 683.3685 701.2349 724.6075 755.3690 793.6682 803.0691 809.5352 843.9389 863.5154 878.9052 888.5678 906.0233 923.4935 928.7159 937.9958 946.7547 961.4501 966.5028 978.7298 1007.1928 1015.5936 1028.8919 1041.7995 1068.7933 1076.0680 1093.3226 1094.1054 1104.0744 1112.4260 1139.0400 1142.1555 1163.2274 1168.5725 1179.3957 1190.4025 1201.6100 1217.1363 1219.8235 1232.5950 1242.2441 1253.8819 1267.6337 1289.3978 1309.2404 1323.9722 1332.7073 1335.6355 1337.4819 1341.5071 1349.5033 1355.5663 1369.7816 1379.2815 1383.3857 1386.0126 1417.6009 1436.4375 1455.7097 1461.0464 1464.0770 1464.3218 1465.1982 1472.8125 1474.8984 1475.9492 1481.3552 1485.9911 1488.1483 1496.9178 1498.7124 1578.7498 1620.6530 2934.6056 2954.8940 2965.1256 2965.2438 2967.2316 2969.5636 2973.7433 2974.5642 2999.2331 3003.7876 3013.8189 3019.0441 3029.8378 3034.7243 3040.8004 3052.2200 3062.3097 3066.0569 3079.1170 3085.4179 3085.5633 3109.8657 3120.4046 3160.6358 3162.4364 3574.4373
redmass: 4.3654 3.5183 3.5020 3.3102 2.8764 3.7801 3.6397 2.5174 2.9205 1.0906 1.4769 1.1782 1.8352 2.9985 2.9544 2.1769 2.1606 2.2015 2.4323 2.1815 2.1221 2.5618 3.5576 2.9383 2.2549 3.1983 2.8308 3.6799 3.5183 3.5960 2.2862 2.9032 3.5316 3.9494 4.8884 2.6984 2.9943 3.1673 1.9368 1.8316 1.9978 2.2601 2.1904 1.9888 1.6973 1.8781 1.7495 1.8754 1.6369 2.1852 1.8070 4.3469 1.5587 4.8126 1.9692 2.2052 1.6473 2.4170 1.4529 1.7024 1.9816 2.0345 1.2597 1.4311 2.4200 1.4380 1.5044 1.3870 1.7282 1.9928 1.6440 1.9561 2.3472 2.3222 1.6333 1.4215 1.5139 1.4591 1.3988 1.2949 1.6704 1.4706 1.5261 1.4295 1.3785 1.2068 2.8064 1.3694 1.2403 3.2049 1.2065 1.0976 1.0838 1.0709 1.0803 1.0509 1.0905 1.0971 1.0823 1.1068 1.0900 1.1125 1.7978 1.1083 6.9218 6.6873 1.0822 1.0331 1.0606 1.0568 1.0598 1.0454 1.0376 1.0617 1.0877 1.0641 1.0704 1.0969 1.0947 1.1009 1.1037 1.1008 1.0986 1.0984 1.0985 1.0984 1.1019 1.0891 1.0991 1.0913 1.0922 1.0663
irintensity: 0.3312 1.4312 0.4709 2.7648 6.1445 0.4400 2.2609 0.6099 4.4151 0.4602 0.8515 0.3351 5.3836 0.2111 4.3048 38.7525 29.1997 8.2917 21.4188 14.2321 7.1643 13.6925 2.3151 1.3453 0.8186 0.9608 9.5215 1.7006 3.3267 1.9478 2.4231 1.7715 1.3546 2.7289 9.0731 0.5498 3.1690 6.2489 7.7497 13.0630 14.9275 11.7903 21.4207 6.2966 17.5437 6.5897 3.4105 2.1749 2.5334 5.2639 0.5753 91.6551 17.7763 79.8631 1.8456 10.9380 0.7502 11.6124 2.9187 13.5830 1.3863 6.6947 0.1473 4.3190 1.6090 2.1914 10.2752 1.1292 7.6832 59.7805 11.7820 8.9489 66.5523 16.8150 9.1966 15.2987 15.5139 12.1921 5.0903 12.0052 0.4156 3.7119 3.0657 1.2326 1.0544 12.7457 11.3087 19.1195 17.4046 24.8985 3.3687 7.2224 1.1844 1.0027 6.2009 14.0220 27.0524 48.9074 9.6581 12.4877 22.0077 22.9390 65.5537 22.0530 26.4065 75.6992 26.2586 81.0440 26.0366 11.0935 31.4327 57.5181 52.6020 22.4293 22.3886 11.0831 76.9284 49.7778 56.2523 53.9599 50.5281 39.7865 45.0848 42.3448 20.3816 25.3245 34.3423 21.6282 23.6708 11.4405 11.0984 6.6073
temp: 298.150 k
press: 1.00000 atm
elementType: 8 8 6 6 6 6 6 6 6 6 6 6 6 6 6 6 6 6 6 6 1 1 1 1 1 1 1 1 1 1 1 1 1 1 1 1 1 1 1 1 1 1 1 1 1 1
symmnumber: 1
zpe: 1050341.2 jmol-1
zpe.correction: 0.400054 hartree
zpe.thermalcorrener: 0.419611 hartree
zpe.thermalcorrenthalpy: 0.420555 hartree
zpe.thermalcorrgfe: 0.354192 hartree
zpe.sumelectzpe: -850.401653 hartree
zpe.sumelectthermal: -850.382097 hartree
zpe.sumelectthermalent: -850.381152 hartree
zpe.sumelectthermalfe: -850.447515 hartree
dipole: -1.6733 0.3356 1.0675
dipole: 2.0130
quadrupole: -112.4758 -116.2844 -128.9449
quadrupole: -2.2175 13.1102 -0.2651
quadrupole: 6.7592 2.9506 -9.7099 -2.2175 13.1102 -0.2651
hfenergy: -850.8017072 hartree
pointgroup: C01 [X(C18H26O2)]
dipole: -0.6633527 -0.0063162 0.4325986 debye
polarizability: 234.638801|7.2917228|189.333286|16.6775607|-1.3943358|158.9444005 unknown
InChI: InChI=1S/C18H26O2/c1-17(12-19)9-4-10-18(2)15-11-14(20-3)7-5-13(15)6-8-16(17)18/h5,7,11,16,19H,4,6,8-10,12H2,1-3H3
charge 0 multiplicity 1
46 atoms
O  2.345793 0.086044 -2.992307
O  -3.977124 -1.226174 -0.492037
C  1.880792 0.33523 0.915858
C  0.584019 -0.483303 1.294218
C  2.560411 -0.02403 -0.470894
C  0.841803 -1.999511 1.051712
C  2.699304 -1.572962 -0.580215
C  1.635883 1.850203 1.166476
C  1.370039 -2.32051 -0.35916
C  -0.667774 0.061353 0.567327
C  0.30296 -0.320685 2.826449
C  0.373383 2.437347 0.482698
C  1.772152 0.522841 -1.702481
C  3.992126 0.576182 -0.518699
C  -0.777195 1.455639 0.273202
C  -1.771652 -0.777419 0.289106
C  -1.981232 1.944301 -0.283736
C  -2.966877 -0.270173 -0.270164
C  -3.084636 1.109144 -0.560555
C  -5.238838 -0.750056 -1.059739
H  2.642289 0.019085 1.664175
H  -0.065614 -2.587768 1.281717
H  1.606039 -2.325017 1.788787
H  3.421182 -1.914424 0.190396
H  3.156142 -1.832226 -1.555399
H  2.520919 2.43684 0.859809
H  1.548264 1.996392 2.258701
H  1.526466 -3.411755 -0.463432
H  0.617269 -2.033812 -1.120747
H  1.205658 -0.57258 3.416465
H  -0.012569 0.70328 3.08841
H  -0.511421 -1.003289 3.132233
H  0.642684 2.860719 -0.505221
H  0.012644 3.300149 1.078023
H  1.857906 1.620818 -1.741775
H  0.700666 0.255378 -1.651817
H  3.98593 1.678672 -0.442143
H  4.616528 0.179474 0.30447
H  4.471974 0.317482 -1.479607
H  -1.741107 -1.849825 0.499943
H  -2.058537 3.014972 -0.514042
H  2.077269 -0.851818 -3.157596
H  -3.997097 1.53221 -0.990642
H  -5.726386 -0.007983 -0.396994
H  -5.873771 -1.644636 -1.142932
H  -5.089061 -0.305296 -2.063345
