program: Gaussian 09
title: 000263895
version: EM64L-G09RevD.01
frameworkgroup: C1[X(C9H10N2O3)]
method: RPBEPBE
basis: SDD
operation: Freq
keyword: #p
keyword: freq=noraman
keyword: PBEPBE/SDD
title: #p freq=noraman PBEPBE/SDD
converged: YES YES NO NO
title: Mulliken charges:
elementType: O O O N N C C C C C C C C C H H H H H H H H H H
charge: -0.157295 -0.241375 -0.245595 -0.346289 -0.621496 -0.200676 -0.336696 -0.286717 -0.262852 -0.246925 -0.530558 0.139812 0.120516 0.204364 0.279662 0.298540 0.316448 0.283954 0.294772 0.241659 0.286156 0.327770 0.338880 0.343941
chargesum: 0.00000
title: Mulliken charges with hydrogens summed into heavy atoms:
elementType: O O O N N C C C C C C C C C
charge: -0.157295 -0.241375 -0.245595 -0.018519 0.061325 0.078986 -0.038155 0.029731 0.021102 0.047847 -0.002743 0.139812 0.120516 0.204364
polarizability: 1.17303929e+02 5.05523249e+00 1.17356512e+02 3.52684015e+00 -3.62645320e+00 8.42522514e+01
1716.lowfreq: -6.0695 0.0004 0.0008 0.0008 13.4982 19.5314 61.0246 91.5165 101.1657
frequency: 61.0177 91.5022 101.1498 116.7241 188.7091 242.5049 268.1121 363.1338 375.9963 437.4837 454.0513 499.8344 516.9270 543.1545 566.2406 581.2915 594.5306 643.0616 672.4221 706.6005 726.5355 757.2171 771.7134 820.5685 879.7239 898.3335 918.8239 928.5407 932.4309 956.4891 968.0618 1002.6345 1032.0933 1053.0957 1065.7572 1101.5321 1120.9272 1140.5647 1166.1805 1197.0510 1209.7523 1215.4874 1234.7508 1246.7051 1270.4391 1281.2916 1284.8961 1295.0054 1298.2349 1348.0254 1369.8646 1487.0617 1599.4476 1643.3194 1664.8848 1679.4944 3004.3929 3028.6178 3067.2682 3090.2278 3102.1411 3107.5720 3128.5204 3501.7680 3571.6373 3656.2759
redmass: 6.6044 7.4606 7.1939 7.2736 4.7614 7.4609 5.6217 4.2771 2.7022 4.1404 4.8476 4.6541 2.5963 2.1006 1.2636 1.2938 2.6578 3.2037 4.3237 5.6074 3.9824 5.4225 4.8343 4.6679 2.5746 4.0944 2.6783 3.0751 2.0017 3.0326 2.3068 1.5802 2.1794 1.9461 1.7652 1.1194 2.0914 2.5134 1.7932 1.7290 1.7550 1.3905 1.5604 1.4412 1.5296 1.5695 1.7348 1.6907 1.9133 2.9052 1.8398 1.0928 1.5097 3.2222 8.9120 11.8366 1.0845 1.0631 1.0881 1.0884 1.0918 1.1029 1.0913 1.0452 1.0793 1.1046
irintensity: 9.5053 5.2328 10.7124 1.1681 2.8918 3.1658 4.1369 1.0015 3.8401 14.7417 6.0308 4.6569 13.8318 40.6077 12.4445 326.3342 7.0057 23.3984 8.0157 22.9234 5.2341 2.9367 3.4175 10.4756 4.8107 0.9181 14.0160 1.4830 1.1011 12.0004 1.0615 4.5783 22.8131 6.0324 1.8278 1.9928 12.8363 16.5578 2.9270 39.8578 15.6751 1.7377 18.6603 4.0375 2.0860 14.0541 70.1527 2.4452 17.4917 102.4754 21.7295 22.3515 93.8122 235.7555 424.4971 191.8367 10.8993 24.3268 14.8577 10.7512 21.9288 11.1781 2.2588 37.4675 42.5660 37.2381
temp: 298.150 k
press: 1.00000 atm
elementType: 8 8 8 7 7 6 6 6 6 6 6 6 6 6 1 1 1 1 1 1 1 1 1 1
symmnumber: 1
zpe: 489570.5 jmol-1
zpe.correction: 0.186468 hartree
zpe.thermalcorrener: 0.197651 hartree
zpe.thermalcorrenthalpy: 0.198595 hartree
zpe.thermalcorrgfe: 0.149164 hartree
zpe.sumelectzpe: -683.127988 hartree
zpe.sumelectthermal: -683.116805 hartree
zpe.sumelectthermalent: -683.115861 hartree
zpe.sumelectthermalfe: -683.165291 hartree
dipole: -0.2818 0.8936 2.4802
dipole: 2.6513
quadrupole: -76.9329 -94.7696 -81.4937
quadrupole: 9.5233 -7.1532 -4.5558
quadrupole: 7.4659 -10.3709 2.9050 9.5233 -7.1532 -4.5558
hfenergy: -683.3144553 hartree
pointgroup: C01 [X(C9H10N2O3)]
dipole: -0.144891 0.3741576 0.9628272 debye
dipolederiv: -0.6054094 -0.1659753 -0.2253546 -0.1242278 -0.4966297 -0.2541045 -0.2795237 -0.424134 -0.6839525 -0.5181712 -0.0439208 -0.0389203 -0.0849173 -1.2027289 0.1642823 -0.014965 0.3678156 -0.4198643 -0.8055515 0.2794671 -0.0475839 0.0622298 -0.8360871 0.1168288 -0.0616741 0.1627051 -0.3588893 -0.7660361 -0.3974117 0.1354858 -0.10727 -0.7187225 -0.0147741 0.0779688 -0.0273145 -0.3981441 -0.5533602 -0.3863814 0.1546658 -0.2979859 -0.9410096 0.0765826 0.126077 0.0398834 -0.652333 -0.0096694 0.0098307 -0.0397534 -0.0075439 0.0377273 0.0088416 -0.0177498 0.0456574 0.1509185 -0.1501825 0.1693303 -0.0503904 0.1482501 -0.1524954 0.1352254 -0.08243 0.1161661 0.0374459 -0.2958955 -0.0588625 -0.1252928 -0.0792994 0.0370136 -0.0427181 -0.0936571 -0.0847143 -0.0619066 -0.3742339 -0.0157365 -0.0234821 0.1486098 0.0634972 0.015136 -0.1056931 0.0451379 0.1027445 0.1231095 0.0478113 0.009932 0.0477796 0.2817838 -0.1573636 -0.0444904 -0.2512225 0.0868636 0.0375539 0.0826249 -0.0426027 0.0650242 0.0812247 -0.0188277 0.0248518 -0.0080721 0.0087309 0.9402149 0.0836909 0.2989886 0.0299758 0.4070875 0.4645311 0.3060623 0.6472204 0.6615222 0.9859215 0.3979749 0.1030436 0.2243891 1.4641457 -0.2946783 0.1965019 -0.4111595 0.2445886 1.2624984 0.1062395 -0.0343773 0.1467109 1.3511004 -0.3186565 0.096533 -0.3074499 0.2167812 0.0436657 0.0175654 0.064734 0.0122057 0.0466217 -0.0659583 0.0632924 -0.0511492 -0.0984804 0.0147939 -0.0596561 -0.0569639 -0.0577625 0.0029461 -0.0435972 -0.042421 -0.0358435 0.0384596 0.068328 0.0623646 0.0378249 0.0504658 0.0229112 -0.0510461 0.0356951 -0.0500196 0.0291008 0.0334625 -0.0092833 -0.0174201 -0.0285808 0.0179254 0.0805603 -0.0016783 0.0512917 -0.0520406 -0.0604027 -0.0565347 0.0629948 -0.049146 -0.0024242 0.0153656 0.0597325 0.0244819 0.0644699 0.0285047 -0.1219824 0.064416 -0.0575773 -0.0850813 0.0808877 0.0393052 0.0487494 0.0578426 -0.0244992 0.0242586 -0.0937417 -0.0186459 0.0809729 -0.0281756 -0.0808482 -0.0222676 0.0519829 0.2425216 -0.0289018 -0.0602204 -0.0605792 0.1476127 0.0588361 -0.1064681 0.0607195 0.2711365 0.1710401 0.0158623 -0.0289482 -0.0070115 0.1877659 0.041722 -0.0263167 0.0436228 0.3546702 0.2117965 0.0476258 -0.0470336 0.0449067 0.2048426 0.0311004 -0.0681047 0.0198956 0.3483531 unknown
polarizability: 116.4645246|5.1455545|117.8819067|3.8616691|-4.4234864|84.5662615 unknown
InChI: InChI=1S/C9H10N2O3/c10-8(13)4-3-1-2-5(4)9(14)11-6(2)7(3)12/h2-6,11H,1,10H2
charge 0 multiplicity 1
24 atoms
O  -1.816674 -1.892778 -1.553919
O  -0.894741 2.884587 -0.441474
O  3.068895 -0.930851 0.08975
N  -2.150519 0.909921 -0.04233
N  2.901062 1.321877 -0.457808
C  -0.715382 -0.232867 1.495356
C  0.065785 0.866966 0.707725
C  0.258124 -1.430307 -0.20764
C  0.829799 0.016133 -0.403369
C  -1.904886 -0.44201 0.500431
C  0.135633 -1.515746 1.342806
C  -1.229857 -1.35948 -0.588168
C  -1.019502 1.720402 0.025215
C  2.361909 0.068596 -0.229248
H  -1.020033 0.059247 2.510305
H  0.74456 1.486578 1.310451
H  0.835458 -2.210408 -0.719993
H  0.599508 0.408123 -1.413095
H  -2.814424 -0.895947 0.924912
H  -0.385678 -2.426416 1.687342
H  1.118723 -1.456921 1.834692
H  -2.977669 1.16202 -0.584814
H  3.909039 1.447689 -0.365918
H  2.319974 2.118293 -0.722807
