program: Gaussian 09
title: 000263879
version: EM64L-G09RevD.01
frameworkgroup: C1[X(C15H19NO4S)]
method: RPBEPBE
basis: SDD
operation: Freq
keyword: #p
keyword: freq=noraman
keyword: PBEPBE/SDD
title: #p freq=noraman PBEPBE/SDD
converged: YES YES NO NO
title: Mulliken charges:
elementType: S O O O O N C C C C C C C C C C C C C C C H H H H H H H H H H H H H H H H H H H
charge: 0.923818 -0.285725 -0.530516 -0.539145 -0.243861 -0.536564 -0.195403 -0.127127 -0.159621 -0.030095 -0.527914 -0.525475 -0.502517 0.293007 0.008482 -0.764721 -0.243304 -0.268737 -0.204371 -0.203540 -0.217301 0.316289 0.254162 0.291644 0.260097 0.213546 0.258935 0.244408 0.232289 0.217364 0.244486 0.310317 0.255990 0.243762 0.245588 0.280186 0.290198 0.241734 0.241540 0.238094
chargesum: 0.00000
title: Mulliken charges with hydrogens summed into heavy atoms:
elementType: S O O O O N C C C C C C C C C C C C C C C
charge: 0.923818 -0.285725 -0.530516 -0.539145 -0.243861 -0.226246 0.120886 0.127035 0.132022 0.230003 -0.055433 -0.048778 -0.040666 0.293007 0.008482 -0.019381 0.036882 0.021462 0.037362 0.038000 0.020793
polarizability: 2.26871620e+02 -5.21962000e+00 2.05719798e+02 1.90155883e+01 -8.17717401e+00 1.62640516e+02
1716.lowfreq: -11.5869 -9.4149 -0.0010 -0.0009 0.0008 6.2972 12.8908 23.5259 27.9924
frequency: 9.3382 23.3898 27.7626 32.6529 51.7893 76.7531 88.0184 97.4810 98.5365 145.7364 167.6623 184.4923 199.4702 214.5253 244.1158 252.6557 286.8627 307.3079 327.2443 352.0123 369.5585 404.5299 407.6591 435.5964 459.6239 472.1313 501.7119 559.1439 562.4101 602.8503 613.6981 628.8191 656.6345 691.7922 726.0588 754.9092 762.2161 783.9490 795.1912 798.1195 843.5532 851.2245 854.1308 871.7814 885.0561 908.0997 932.9183 935.6990 939.1623 945.0339 974.8978 978.8615 984.6860 995.0533 1005.7518 1009.2387 1019.8289 1033.5617 1040.6418 1044.5036 1050.3643 1057.2497 1076.6765 1085.9209 1126.1226 1132.7335 1161.7203 1173.1350 1177.2942 1186.3309 1195.5447 1204.8675 1219.8929 1241.5398 1265.1614 1271.4436 1279.5005 1294.2010 1302.0096 1302.9757 1307.4257 1343.0014 1382.6490 1384.8009 1396.0430 1437.0559 1453.6350 1454.0185 1455.1524 1459.5826 1481.8916 1494.8187 1578.9749 1605.3648 1649.6922 3001.0153 3003.5263 3015.4111 3019.2226 3046.4471 3054.0713 3060.1942 3076.2974 3086.5184 3092.6755 3097.9911 3108.0862 3137.6018 3138.8994 3148.9746 3157.9509 3167.0816 3176.0137 3357.7840
redmass: 6.2170 5.6782 4.9910 4.2953 5.3317 1.0391 3.9553 5.4396 4.4799 6.4492 4.5780 5.6184 4.4811 4.1943 6.5298 4.3850 3.1335 3.1787 4.3319 5.5721 6.7270 2.8318 3.0631 5.5012 4.6394 3.0911 4.1822 2.7089 3.3028 6.4734 5.0583 3.4150 6.2981 2.3276 3.1949 3.8812 1.4743 1.8567 2.1728 13.5960 2.3355 1.2472 2.8211 2.5219 2.7806 3.7783 1.9722 1.3619 4.3284 2.9928 2.1625 5.5737 1.4211 1.9140 1.3382 3.9480 1.8171 2.0785 1.8798 1.6842 2.1730 1.5626 1.5903 2.4721 1.2368 1.8047 1.4237 1.0617 1.1222 1.6444 2.9391 1.3465 1.7071 1.4103 1.2300 1.5876 1.3378 1.5270 1.3340 1.3044 1.6155 1.3527 1.2464 8.2808 1.2140 2.2541 2.0354 1.0591 1.0551 1.0847 1.0750 1.0892 5.8538 6.9711 9.9127 1.0610 1.0384 1.0634 1.0604 1.0857 1.1023 1.0898 1.1038 1.1007 1.0913 1.0941 1.0918 1.0858 1.1023 1.0886 1.0927 1.0969 1.1014 1.0738
irintensity: 0.8562 0.4668 0.1748 0.1186 5.8182 0.3934 1.2668 0.2529 1.4469 1.8889 1.0698 4.5239 3.9594 8.9640 8.7536 1.2656 3.9894 4.4461 7.8269 7.7314 2.8830 0.3094 13.0620 111.4278 4.3252 6.8145 61.6771 16.1643 1.0178 0.0106 6.1573 2.3573 3.3518 31.4303 59.0633 15.9992 72.4796 7.7998 23.8010 55.3920 18.3686 0.4151 37.5414 47.4395 2.9906 75.8742 5.1028 2.4714 10.6975 7.4321 57.8126 1.5644 0.0834 66.2175 0.1366 1.2639 5.7646 10.3482 13.6067 8.6626 24.7797 13.2636 4.5894 2.4503 15.6398 4.8076 20.4468 0.4084 6.0365 14.8375 302.5260 9.4870 32.8393 1.2147 14.4460 1.5908 2.0645 11.1697 0.9952 3.6538 3.0955 4.8202 49.2618 6.8331 2.0886 16.2532 13.1783 23.9473 15.0189 12.3103 7.2807 22.7082 3.1917 0.3240 186.1204 26.2076 2.0530 49.1235 22.4433 4.8770 3.1913 6.7071 46.5782 47.2677 30.0855 9.8084 0.1921 1.2681 10.2707 10.7878 2.0449 4.8774 25.5208 17.3369
temp: 298.150 k
press: 1.00000 atm
elementType: 16 8 8 8 8 7 6 6 6 6 6 6 6 6 6 6 6 6 6 6 6 1 1 1 1 1 1 1 1 1 1 1 1 1 1 1 1 1 1 1
symmnumber: 1
zpe: 830583.1 jmol-1
zpe.correction: 0.316352 hartree
zpe.thermalcorrener: 0.337034 hartree
zpe.thermalcorrenthalpy: 0.337978 hartree
zpe.thermalcorrgfe: 0.263170 hartree
zpe.sumelectzpe: -1334.953466 hartree
zpe.sumelectthermal: -1334.932784 hartree
zpe.sumelectthermalent: -1334.931840 hartree
zpe.sumelectthermalfe: -1335.006648 hartree
dipole: -1.8403 0.2878 -6.1688
dipole: 6.4439
quadrupole: -125.0823 -117.3479 -144.4144
quadrupole: -10.0699 4.5739 -1.3704
quadrupole: 3.8659 11.6003 -15.4662 -10.0699 4.5739 -1.3704
hfenergy: -1335.2698179 hartree
pointgroup: C01 [X(C15H19N1O4S1)]
dipole: 0.4113949 -0.7961716 -2.3715373 debye
polarizability: 220.3679768|-11.9866128|209.7899787|-22.8473132|0.1661252|165.0739787 unknown
InChI: InChI=1S/C15H19NO4S/c1-10(17)20-14-9-11-7-8-13(14)15(11)16-21(18,19)12-5-3-2-4-6-12/h2-6,11,13-16H,7-9H2,1H3
charge 0 multiplicity 1
40 atoms
S  1.621869 0.558505 1.14603
O  -2.978727 -1.113972 0.080227
O  0.6799 -0.396908 2.080285
O  2.51025 1.775872 1.766685
O  -4.204966 -0.754588 2.035255
N  0.625561 1.38296 -0.214765
C  -1.875215 1.092183 0.50564
C  -1.396183 1.367886 -1.724482
C  -0.690795 0.763536 -0.463996
C  -3.034436 0.354734 -0.211192
C  -2.712927 0.535544 -1.728703
C  -2.090998 2.618616 0.268899
C  -1.736749 2.814384 -1.254515
C  -3.576775 -1.52972 1.280083
C  2.744981 -0.589263 0.155033
C  -3.326156 -3.002785 1.514147
C  3.849261 -0.024531 -0.503138
C  2.445215 -1.960037 0.157847
C  4.698281 -0.89932 -1.218804
C  3.306764 -2.81808 -0.56581
C  4.42396 -2.288025 -1.252526
H  -1.742683 0.795502 1.555396
H  -0.816084 1.308304 -2.657254
H  -0.544226 -0.325908 -0.567681
H  -4.022724 0.726459 0.106918
H  -3.524733 1.04955 -2.271067
H  -2.565251 -0.456613 -2.189643
H  -1.433745 3.217719 0.924801
H  -3.126708 2.919467 0.505063
H  -2.57939 3.233167 -1.831726
H  -0.878553 3.496786 -1.39366
H  0.574357 2.371292 0.102022
H  -2.350705 -3.123658 2.020768
H  -3.286607 -3.55449 0.561979
H  -4.109286 -3.414594 2.168304
H  4.045072 1.050584 -0.444423
H  1.585329 -2.335341 0.722179
H  5.570915 -0.497734 -1.744167
H  3.107274 -3.894466 -0.586258
H  5.08793 -2.958813 -1.808448
