program: Gaussian 09
title: 000263874
version: EM64L-G09RevD.01
frameworkgroup: C1[X(C14H17N3)]
method: RPBEPBE
basis: SDD
operation: Freq
keyword: #pfreq=noraman
keyword: PBEPBE/SDD
title: #p freq=noraman PBEPBE/SDD
converged: NO YES NO NO
title: Mulliken charges:
elementType: N N N C C C C C C C C C C C C C C H H H H H H H H H H H H H H H H H
charge: -0.180702 -0.103750 -0.018657 -0.163139 -0.135028 -0.103113 -0.318130 -0.522519 -0.452410 -0.463475 -0.547807 0.469504 -0.426353 -0.366492 -0.217870 -0.224285 -0.240381 0.239538 0.258279 0.262637 0.252223 0.257890 0.227263 0.228309 0.206247 0.209375 0.231460 0.218594 0.250665 0.229364 0.256832 0.226924 0.229097 0.229912
chargesum: 0.00000
title: Mulliken charges with hydrogens summed into heavy atoms:
elementType: N N N C C C C C C C C C C C C C C
charge: -0.180702 -0.103750 -0.018657 0.076399 0.123251 0.159524 -0.065907 -0.037367 -0.017854 -0.022639 -0.078549 0.469504 -0.196989 -0.109660 0.009054 0.004812 -0.010469
polarizability: 1.84943075e+02 -1.49914063e+01 1.51122414e+02 6.94947450e+00 1.11114906e+01 1.34805664e+02
1716.lowfreq: -15.6372 -9.5072 -0.0004 0.0005 0.0006 10.0763 17.9004 30.0300 38.1398
frequency: 17.6020 29.1908 37.4499 98.7468 147.7413 174.5859 220.2775 251.3353 308.4900 331.3126 358.3623 404.2828 408.2390 451.8032 462.5784 519.4664 558.2120 586.1202 616.2627 674.5532 708.3401 744.8743 752.8759 772.1010 795.5504 802.3158 832.2918 842.2145 858.1194 862.2417 864.7259 879.9947 885.9444 905.0988 923.9854 931.6844 957.1977 963.8462 977.2698 980.7071 989.3679 999.1171 1005.6456 1025.1156 1038.8043 1045.6799 1050.4730 1090.5868 1104.8498 1113.7094 1153.2116 1172.4507 1182.6798 1186.0168 1186.5169 1199.5652 1208.6105 1224.6829 1234.2806 1258.9786 1269.2969 1270.8624 1277.1627 1291.0960 1297.0450 1310.3528 1319.6098 1331.4095 1346.0994 1385.1853 1388.2534 1441.1590 1450.5789 1469.1082 1472.1833 1483.0783 1490.0327 1595.2616 1612.9492 2994.8497 2998.2966 3008.5014 3012.2931 3021.1718 3047.3874 3051.2366 3056.3232 3062.4568 3075.9710 3090.4417 3092.0713 3112.2834 3122.0743 3133.5504 3145.5385 3163.0592
redmass: 3.9759 4.5682 4.0516 4.0188 3.7073 4.8207 4.3874 2.0613 2.4983 5.3018 3.6356 2.8335 2.7842 2.3885 3.6079 4.0994 5.2492 4.9447 6.2638 4.1890 1.7314 2.7231 2.6928 3.1550 2.1108 3.1292 4.1401 3.1724 1.2484 2.8491 2.4504 3.0094 3.5380 1.9335 2.7362 1.8235 2.2099 1.6331 2.1887 1.3852 6.1677 1.3251 1.5750 2.2689 1.4202 1.8797 2.0635 1.5499 1.1104 1.1686 2.3329 1.0562 1.8462 1.3779 1.3113 2.6888 1.2639 1.9002 1.3702 1.3635 1.6972 1.8993 1.7099 1.4224 1.5270 1.6042 1.4063 1.4653 1.3252 5.8102 5.5845 1.8549 1.2082 1.0802 1.0897 2.2099 1.0966 6.0654 6.0471 1.0612 1.0586 1.0861 1.0621 1.0603 1.0879 1.1033 1.1008 1.0904 1.1042 1.0926 1.1046 1.0878 1.0865 1.0909 1.0959 1.1014
irintensity: 0.4320 0.9113 0.2554 1.5737 0.8443 1.2200 6.7142 1.0990 1.5939 2.2273 0.3287 0.1854 1.8776 0.3301 6.9945 5.9465 2.1674 14.0205 0.4864 7.6632 61.9235 41.0293 8.5006 5.9668 0.6909 6.5926 8.1025 18.9392 0.1295 0.6265 0.9790 37.8189 21.9602 8.9218 4.5361 14.8731 21.9827 0.6130 12.1675 0.2502 0.1277 0.5351 1.2137 12.9425 13.9326 15.6170 35.4479 9.1869 1.5957 3.0685 0.6020 0.1725 8.0614 5.5272 0.4741 4.6375 1.3071 28.6621 23.3810 0.0689 21.1903 6.6584 5.0018 1.3199 0.8980 0.4666 6.8600 19.0174 2.9836 36.4588 18.6312 4.5064 23.0172 3.6442 19.4817 11.4747 8.5090 1.2324 4.3334 38.2147 29.6507 18.9530 65.9345 28.2784 23.5438 5.0942 3.8062 36.5312 60.7761 33.2357 24.8241 9.4865 1.0805 9.0363 34.5901 25.5291
temp: 298.150 k
press: 1.00000 atm
elementType: 7 7 7 6 6 6 6 6 6 6 6 6 6 6 6 6 6 1 1 1 1 1 1 1 1 1 1 1 1 1 1 1 1 1
symmnumber: 1
zpe: 748004.4 jmol-1
zpe.correction: 0.284900 hartree
zpe.thermalcorrener: 0.298415 hartree
zpe.thermalcorrenthalpy: 0.299359 hartree
zpe.thermalcorrgfe: 0.242408 hartree
zpe.sumelectzpe: -706.645030 hartree
zpe.sumelectthermal: -706.631514 hartree
zpe.sumelectthermalent: -706.630570 hartree
zpe.sumelectthermalfe: -706.687522 hartree
dipole: -0.5136 4.2319 0.0338
dipole: 4.2631
quadrupole: -93.6272 -109.1827 -96.5530
quadrupole: 3.7957 2.5795 2.0393
quadrupole: 6.1604 -9.3951 3.2346 3.7957 2.5795 2.0393
hfenergy: -706.9299294 hartree
pointgroup: C01 [X(C14H17N3)]
dipole: 0.0693745 -1.6675322 -0.1663211 debye
polarizability: 182.5066934|-16.4819518|155.7686984|-9.1806767|-8.4083847|132.5957609 unknown
InChI: InChI=1S/C14H17N3/c1-2-4-10(5-3-1)9-17-14-12-7-6-11(8-12)13(14)15-16-17/h1-5,11-14H,6-9H2
charge 0 multiplicity 1
34 atoms
N  -0.282962 0.678644 0.945602
N  -1.411556 2.283543 -0.155607
N  -0.509323 2.054981 0.752974
C  -2.17699 -1.01647 0.673326
C  -3.363494 0.617924 -0.403557
C  -1.063909 -0.157114 -0.001167
C  -1.886915 0.960557 -0.755069
C  -3.227643 0.067722 1.045709
C  -2.902372 -1.795504 -0.467947
C  -3.737116 -0.672741 -1.195636
C  0.924016 0.254041 1.663771
C  2.08199 -0.143491 0.744585
C  2.66043 -1.43364 0.821173
C  2.592713 0.785075 -0.199489
C  3.735209 -1.793764 -0.025708
C  3.664022 0.428044 -1.046683
C  4.239172 -0.863093 -0.962164
H  -1.810243 -1.652396 1.495753
H  -4.04745 1.467209 -0.551171
H  -0.389391 -0.757672 -0.639264
H  -1.723473 1.020924 -1.844471
H  -2.853297 0.812975 1.767794
H  -4.169815 -0.363702 1.426594
H  -3.56107 -2.576237 -0.047831
H  -2.186964 -2.296706 -1.145549
H  -3.491202 -0.588275 -2.269626
H  -4.821464 -0.869354 -1.118359
H  0.671368 -0.588361 2.335188
H  1.210095 1.11218 2.298888
H  2.270701 -2.159651 1.546385
H  2.146486 1.785054 -0.265033
H  4.174944 -2.795189 0.044041
H  4.053249 1.154004 -1.769534
H  5.071158 -1.139021 -1.619817
