program: Gaussian 09
title: 000024397
version: EM64L-G09RevD.01
frameworkgroup: C1[X(C15H12ClN3O)]
method: RPBEPBE
basis: SDD
operation: Freq
keyword: #p
keyword: freq=noraman
keyword: PBEPBE/SDD
title: #p freq=noraman PBEPBE/SDD
converged: NO YES NO NO
title: Mulliken charges:
elementType: Cl O N N N C C C C C C C C C C C C C C C H H H H H H H H H H H H
charge: -0.062356 -0.336480 -0.025632 -0.041660 -0.595722 0.220849 0.191385 0.281474 0.061880 -0.561749 -0.334040 0.105948 -0.338269 -0.369668 -0.364244 -0.135203 -0.230807 -0.245252 -0.234901 -0.239818 0.265989 0.283531 0.292836 0.261421 0.279641 0.258617 0.258427 0.227958 0.229586 0.230486 0.333458 0.332314
chargesum: 0.00000
title: Mulliken charges with hydrogens summed into heavy atoms:
elementType: Cl O N N N C C C C C C C C C C C C C C C
charge: -0.062356 -0.336480 -0.025632 -0.041660 0.070050 0.220849 0.191385 0.281474 0.061880 -0.012229 -0.041204 0.105948 -0.076848 -0.090028 -0.105627 -0.135203 0.027620 -0.017294 -0.005315 -0.009331
polarizability: 2.53796372e+02 9.61727345e+00 2.66649682e+02 -2.22920721e+01 -2.44968494e+00 1.22601867e+02
1716.lowfreq: -7.6506 -0.0030 -0.0023 -0.0023 3.6907 11.4044 39.8613 55.1050 69.5963
frequency: 39.8587 55.0900 69.5768 76.9529 101.0455 126.8213 162.6255 184.9526 230.1904 254.8869 287.1490 304.7367 314.1057 358.5862 365.0992 400.8583 407.0152 423.0893 426.6781 446.6268 488.3334 495.5738 514.3180 542.0104 560.6400 591.3506 615.1831 622.6546 637.0351 660.1064 685.0597 693.5425 728.8942 743.4727 771.8200 808.3812 828.0950 846.3695 887.9316 889.3717 899.9762 926.2135 959.4799 962.9201 977.4544 980.7159 988.3346 996.3568 1031.6248 1060.2827 1084.3726 1090.7612 1112.7249 1136.3925 1149.2544 1174.6466 1199.0399 1220.4578 1255.4775 1277.2521 1303.2894 1303.8849 1329.4425 1369.6998 1374.9984 1380.3766 1410.8714 1429.8342 1446.3579 1455.2957 1474.6030 1490.5200 1536.3482 1578.5985 1591.3006 1603.4861 1607.0594 1648.3645 3033.6075 3127.2443 3132.5747 3138.0842 3151.7801 3157.0680 3165.0271 3167.1891 3178.0137 3190.5431 3539.0460 3692.2193
redmass: 6.6079 4.1620 6.3426 6.5602 5.6048 4.6779 7.1153 6.3967 5.5119 6.9480 5.6465 7.5850 5.7626 4.4010 6.0926 2.7824 2.1505 3.1062 1.7709 4.6481 3.4935 3.1687 3.1167 3.4721 3.4832 2.0570 6.0945 4.3279 5.5273 6.3191 6.4871 1.8090 5.1106 4.7455 2.0221 4.1011 1.6649 1.2552 3.5343 2.7814 1.7904 1.4590 1.3394 4.9730 1.3967 2.1500 5.6925 1.3407 2.1961 2.2899 2.0652 1.6598 1.7597 2.9697 1.5597 1.0551 1.1329 2.0998 1.8593 1.9882 1.4748 2.3592 1.6209 5.0235 5.2729 6.8108 4.1889 2.5384 1.2408 2.5171 3.0680 2.9890 7.3792 5.8357 6.4259 1.5662 5.5865 3.3866 1.0626 1.0849 1.1029 1.0891 1.0942 1.0881 1.0993 1.0925 1.0979 1.0951 1.0456 1.1043
irintensity: 0.6922 0.7768 1.6646 1.0483 0.0948 6.1168 1.9391 3.9988 0.0384 4.3527 3.7998 4.5104 0.4697 3.2742 11.5289 4.9433 54.8915 4.0929 89.2662 0.9797 2.3149 40.0820 20.0238 17.4948 27.1560 100.2314 0.6886 16.0255 11.2454 5.4131 20.6596 53.7944 2.5020 10.6624 46.5529 20.8313 42.2237 2.1393 3.2894 7.1629 5.9706 1.0703 0.7332 12.3880 1.5000 17.1348 0.4927 0.2999 7.9305 4.6367 22.5152 15.6911 13.3297 44.4751 4.4932 0.0230 4.7308 14.9856 14.6185 50.6618 3.9504 5.5369 4.5569 72.8474 43.4742 26.3426 44.0988 43.0406 51.7817 94.7799 16.4043 3.5753 1.5362 2.9614 17.5991 8.1796 0.8224 611.1759 12.4701 0.4408 2.0446 10.3807 33.0598 1.4862 19.8609 2.0400 5.5096 4.8297 126.1575 41.5792
temp: 298.150 k
press: 1.00000 atm
elementType: 17 8 7 7 7 6 6 6 6 6 6 6 6 6 6 6 6 6 6 6 1 1 1 1 1 1 1 1 1 1 1 1
symmnumber: 1
zpe: 628856.2 jmol-1
zpe.correction: 0.239519 hartree
zpe.thermalcorrener: 0.255969 hartree
zpe.thermalcorrenthalpy: 0.256913 hartree
zpe.thermalcorrgfe: 0.195167 hartree
zpe.sumelectzpe: -1276.900600 hartree
zpe.sumelectthermal: -1276.884150 hartree
zpe.sumelectthermalent: -1276.883206 hartree
zpe.sumelectthermalfe: -1276.944952 hartree
dipole: 0.3140 3.2620 0.2197
dipole: 3.2845
quadrupole: -127.7537 -100.1329 -120.5307
quadrupole: -5.0786 -1.3892 -2.5594
quadrupole: -11.6146 16.0062 -4.3916 -5.0786 -1.3892 -2.5594
hfenergy: -1277.1401191 hartree
pointgroup: C01 [X(C15H12Cl1N3O1)]
dipole: 0.7395109 1.0578556 -0.0621702 debye
polarizability: 249.2199163|5.7110665|269.4404361|-17.1382934|21.2493607|124.3875682 unknown
InChI: InChI=1S/C15H12ClN3O/c16-11-6-7-13-12(8-11)15(10-4-2-1-3-5-10)19(20)9-14(17)18-13/h1-8H,9,17H2
charge 0 multiplicity 1
32 atoms
Cl 1.043819 -4.519824 0.610921
O  -1.058007 2.728667 1.16182
N  -0.178591 1.751503 0.943589
N  2.32156 1.226553 -0.812197
N  2.184226 3.551384 -0.545941
C  -0.445489 0.523596 0.41086
C  0.667233 -0.42695 0.164615
C  -1.845893 0.144709 0.10034
C  1.943534 -0.070301 -0.423863
C  1.252982 2.113855 1.243317
C  0.42521 -1.805808 0.463087
C  1.958418 2.270689 -0.093864
C  2.878623 -1.107395 -0.722415
C  -2.959678 0.651393 0.83319
C  -2.100185 -0.754771 -0.978269
C  1.389436 -2.777648 0.187354
C  2.625798 -2.451754 -0.417406
C  -4.270626 0.240171 0.515998
C  -3.414473 -1.145744 -1.302738
C  -4.508548 -0.655087 -0.552644
H  1.210129 3.035795 1.838826
H  1.726111 1.302087 1.822054
H  -0.526446 -2.093419 0.917862
H  3.814909 -0.81064 -1.203981
H  -2.792158 1.370445 1.636903
H  -1.26278 -1.136231 -1.571293
H  3.360731 -3.229752 -0.642363
H  -5.112087 0.631639 1.098497
H  -3.584321 -1.829192 -2.141903
H  -5.531015 -0.960435 -0.801567
H  1.869782 4.360886 -0.017413
H  2.566195 3.67848 -1.482178
