program: Gaussian 09
title: 000024369
version: EM64L-G09RevD.01
frameworkgroup: C1[X(C11H12Cl2N2O)]
method: RPBEPBE
basis: SDD
operation: Freq
keyword: #p
keyword: freq=noraman
keyword: PBEPBE/SDD
title: #p freq=noraman PBEPBE/SDD
converged: YES YES NO NO
title: Mulliken charges:
elementType: Cl Cl O N N C C C C C C C C C C C H H H H H H H H H H H H
charge: -0.076861 -0.064629 -0.196521 -0.385745 0.057488 -0.654707 0.406068 -0.402921 -0.371511 0.226601 -0.217585 -0.223238 -0.239536 0.327993 -0.699916 -0.730685 0.256232 0.255585 0.244742 0.243539 0.234232 0.232771 0.360708 0.234839 0.306128 0.277881 0.302818 0.296228
chargesum: 0.00000
title: Mulliken charges with hydrogens summed into heavy atoms:
elementType: Cl Cl O N N C C C C C C C C C C C
charge: -0.076861 -0.064629 -0.196521 -0.025036 0.057488 -0.142890 0.406068 -0.158179 -0.127972 0.226601 0.016648 0.009532 -0.004697 0.327993 -0.115906 -0.131639
polarizability: 1.73307510e+02 -4.77166235e-01 1.69325410e+02 9.17139502e+00 -2.74799225e+00 1.35188091e+02
1716.lowfreq: -9.5330 -5.9255 -4.0426 -0.0031 -0.0029 -0.0029 12.2870 25.5281 33.5742
frequency: 10.2441 25.5146 33.5724 46.3082 55.0385 62.1586 95.5617 121.8979 156.7986 184.9293 218.2852 280.4102 316.7016 326.7584 360.4990 383.5130 402.3018 466.6789 494.7969 536.5171 563.8455 598.4497 604.2107 617.4321 644.9152 657.3873 706.5543 726.3522 761.7619 825.8667 837.1345 858.0699 885.1712 914.1380 924.4888 932.8353 971.4680 981.3155 989.6941 1000.3969 1026.6817 1074.1641 1083.3820 1097.7019 1145.7564 1174.5413 1176.0955 1188.7738 1190.0388 1213.7549 1238.8391 1255.3974 1293.1366 1303.6647 1327.9200 1380.0108 1432.8550 1440.4175 1448.4961 1459.3176 1483.1883 1493.8883 1558.9791 1590.8064 1611.6079 1652.4773 3001.6155 3059.9069 3066.4824 3071.5667 3121.9053 3122.5378 3138.2356 3150.7976 3155.1799 3168.0335 3169.5786 3374.4939
redmass: 6.7843 4.6283 5.3369 8.5603 10.0976 7.7927 7.1377 3.4011 6.6490 9.5731 4.8685 3.9131 2.2787 5.5421 3.9449 4.0867 2.8176 3.6766 4.7821 4.8285 3.8197 5.3595 5.6993 6.2741 3.2494 1.7126 1.7915 3.9622 1.9599 3.7890 4.1233 1.2495 1.5951 2.0061 1.6576 1.8536 3.2194 1.3879 6.2857 1.3135 2.2096 1.9553 1.5843 1.2102 1.7817 1.0931 1.7930 1.4254 1.1288 2.3956 1.1641 1.2158 1.5112 3.4534 1.2720 8.2039 1.1342 2.0976 1.1214 1.1798 2.2827 1.4462 8.5204 6.0037 6.0862 8.3000 1.0637 1.0607 1.0592 1.0970 1.0884 1.0872 1.0908 1.0958 1.1075 1.1015 1.1090 1.0764
irintensity: 0.2373 0.2132 1.4968 0.9894 5.7432 3.0937 4.2173 3.2768 1.4478 6.4213 4.2496 3.4276 1.3350 1.9144 11.6687 15.2769 0.0612 11.7859 45.0531 22.8039 10.3005 19.2667 22.2478 0.4316 18.4333 34.6934 61.3759 59.0299 36.2075 1.0677 70.4498 0.3016 8.0294 3.6110 3.2887 5.5081 18.2370 0.0276 0.3288 0.0638 4.7434 19.6696 8.7093 14.0656 194.4684 1.6653 133.7371 60.1413 0.6046 12.9205 17.1088 2.8959 0.1662 2.7127 0.3851 0.5404 26.0564 6.1560 35.9349 54.4481 17.9239 221.6816 62.4281 2.8811 17.0890 277.0768 10.2550 6.8066 8.9641 3.3886 5.4666 4.1147 7.1293 28.2410 0.9362 16.9040 0.8154 30.0631
temp: 298.150 k
press: 1.00000 atm
elementType: 17 17 8 7 7 6 6 6 6 6 6 6 6 6 6 6 1 1 1 1 1 1 1 1 1 1 1 1
symmnumber: 1
zpe: 553405.6 jmol-1
zpe.correction: 0.210781 hartree
zpe.thermalcorrener: 0.226968 hartree
zpe.thermalcorrenthalpy: 0.227912 hartree
zpe.thermalcorrgfe: 0.162167 hartree
zpe.sumelectzpe: -1530.018298 hartree
zpe.sumelectthermal: -1530.002112 hartree
zpe.sumelectthermalent: -1530.001167 hartree
zpe.sumelectthermalfe: -1530.066913 hartree
dipole: -2.8996 -3.6173 0.0023
dipole: 4.6360
quadrupole: -107.9326 -120.2628 -103.7599
quadrupole: -1.4382 -6.5308 -1.4901
quadrupole: 2.7192 -9.6110 6.8918 -1.4382 -6.5308 -1.4901
hfenergy: -1530.2290792 hartree
pointgroup: C01 [X(C11H12Cl2N2O1)]
dipole: -1.2929558 -0.7044599 -1.0764641 debye
polarizability: 173.5635399|-7.2070549|147.7204627|3.2786331|17.1950591|156.537009 unknown
InChI: InChI=1S/C11H12Cl2N2O/c12-7-10(8-13)14-15-11(16)6-9-4-2-1-3-5-9/h1-5,15H,6-8H2
charge 0 multiplicity 1
28 atoms
Cl 4.95665 -1.583269 -0.033786
Cl 0.969213 0.112745 -2.610652
O  0.658475 2.026919 2.664492
N  0.702275 0.731492 0.700482
N  2.072908 0.714403 0.628834
C  -1.487075 1.456955 1.60621
C  -2.109126 0.303836 0.832095
C  -2.513786 0.460925 -0.519036
C  -2.274506 -0.965407 1.449011
C  0.052758 1.440316 1.739426
C  -3.067438 -0.622955 -1.239495
C  -2.830067 -2.048379 0.733076
C  -3.227084 -1.880962 -0.6153
C  2.65135 -0.00065 -0.32436
C  4.140096 0.116917 -0.392166
C  1.948967 -0.903718 -1.296965
H  -1.748291 2.425629 1.137308
H  -1.867816 1.499439 2.641333
H  -2.402587 1.436477 -1.008285
H  -1.971737 -1.100289 2.494734
H  -3.372907 -0.483555 -2.282066
H  -2.957636 -3.019042 1.225102
H  0.109152 0.293443 -0.021847
H  -3.659358 -2.720706 -1.170303
H  4.518636 0.804456 0.374197
H  4.510073 0.37252 -1.39647
H  2.650844 -1.516535 -1.876028
H  1.180016 -1.539805 -0.830441
