program: Gaussian 09
title: 000263790
version: EM64L-G09RevD.01
frameworkgroup: C1[X(C11H13N3O2)]
method: RPBEPBE
basis: SDD
operation: Freq
keyword: #p
keyword: freq=noraman
keyword: PBEPBE/SDD
title: #p freq=noraman PBEPBE/SDD
converged: YES YES NO NO
title: Mulliken charges:
elementType: O O N N N C C C C C C C C C C C H H H H H H H H H H H H H
charge: -0.229820 -0.226749 -0.441875 -0.014161 0.017325 0.491764 -0.401552 -0.341384 0.385534 0.056400 -0.342440 -0.339571 0.411585 -0.798826 -0.772338 -0.696701 0.228257 0.283242 0.284815 0.284295 0.302521 0.236306 0.239338 0.254947 0.237812 0.238129 0.214889 0.228224 0.210034
chargesum: 0.00000
title: Mulliken charges with hydrogens summed into heavy atoms:
elementType: O O N N N C C C C C C C C C C C
charge: -0.229820 -0.226749 -0.139354 -0.014161 0.017325 0.491764 -0.173295 -0.058141 0.385534 0.056400 -0.057625 -0.055275 0.411585 -0.068235 -0.081508 -0.258442
polarizability: 4.00828480e+02 5.15404465e+00 1.51898513e+02 2.49810394e-01 1.39014609e-01 6.71669435e+01
1716.lowfreq: -0.0007 -0.0002 0.0004 1.5537 7.4542 9.3074 40.8442 41.7540 62.5751
frequency: 40.8044 41.7469 62.5720 63.3056 80.7215 120.6177 140.2054 178.3504 185.7331 218.3977 246.8292 265.8656 313.5807 364.2484 409.4599 418.8030 428.1561 444.9807 497.1595 505.2447 516.0846 549.2011 560.9844 605.4114 628.8308 643.9791 665.5827 694.1344 733.2913 747.4150 784.4603 825.2197 862.7899 862.9548 923.1938 925.7818 977.9283 981.4662 992.2203 1000.4222 1005.8030 1027.7909 1053.3617 1096.4749 1103.5886 1123.9823 1150.9353 1170.3869 1225.8437 1280.9801 1296.5805 1342.9497 1358.2640 1385.0893 1397.7248 1398.4430 1430.2531 1442.7869 1457.1162 1461.9081 1479.4331 1481.7315 1487.8829 1517.8567 1540.5884 1594.5649 1618.3872 1629.8886 2961.7127 2992.8811 3028.9708 3077.4691 3101.8107 3110.1718 3127.4102 3136.6605 3175.6332 3183.6864 3196.5626 3209.0587 3429.5147
redmass: 4.3735 4.8896 2.9070 4.4731 5.7164 2.1155 1.7694 5.5951 1.0311 5.4861 4.3782 4.7612 4.5153 3.7357 3.2218 2.9082 4.2856 2.4303 2.8249 7.3652 2.9676 1.8670 4.7268 1.5858 7.0741 6.6356 4.8196 1.2734 4.7088 4.4483 6.0068 1.3418 1.6091 3.6823 2.3157 1.3487 1.3314 1.6348 2.8847 1.3264 1.4575 1.5252 1.5321 3.3101 1.7648 2.1890 2.4424 1.3826 5.4162 1.6248 1.7335 5.6483 3.5195 1.5398 1.8296 1.6061 1.2831 4.2634 1.0460 1.3915 1.1217 1.0914 1.8494 2.4911 4.3532 5.2650 6.5058 3.9917 1.0427 1.0359 1.0976 1.0971 1.1009 1.0627 1.0905 1.0911 1.0892 1.0945 1.0961 1.1132 1.0744
irintensity: 0.2489 0.1355 0.1563 0.7927 0.1379 0.2932 8.4067 1.9201 1.1189 0.8877 1.8731 5.2013 3.3642 0.4109 5.9165 1.5359 0.1493 7.0078 27.4027 1.7315 3.4267 18.0761 3.7830 38.2590 2.6318 3.1035 24.0835 0.7115 3.1046 0.2064 21.0099 22.0573 57.1343 6.3037 5.6475 71.7382 1.4981 15.5624 0.8839 0.0665 11.6831 5.1932 4.9802 7.7434 66.3093 169.3104 28.8551 220.8998 822.8400 112.2198 86.0409 64.0981 42.4427 22.0148 9.4087 64.1828 0.1787 2.5332 14.7268 45.0674 21.4162 15.5180 90.4022 18.2425 103.5853 8.8962 549.6836 5.6785 19.8328 15.0324 17.2806 17.2782 29.3198 3.9326 11.5137 11.4961 0.4525 1.7498 0.9766 19.2383 27.2899
temp: 298.150 k
press: 1.00000 atm
elementType: 8 8 7 7 7 6 6 6 6 6 6 6 6 6 6 6 1 1 1 1 1 1 1 1 1 1 1 1 1
symmnumber: 1
zpe: 590956.9 jmol-1
zpe.correction: 0.225084 hartree
zpe.thermalcorrener: 0.240715 hartree
zpe.thermalcorrenthalpy: 0.241659 hartree
zpe.thermalcorrgfe: 0.181029 hartree
zpe.sumelectzpe: -740.382673 hartree
zpe.sumelectthermal: -740.367042 hartree
zpe.sumelectthermalent: -740.366098 hartree
zpe.sumelectthermalfe: -740.426728 hartree
dipole: -8.5139 -3.4920 -0.0010
dipole: 9.2022
quadrupole: -123.3083 -83.7785 -97.6525
quadrupole: -1.2967 0.0557 0.0280
quadrupole: -21.7286 17.8013 3.9273 -1.2967 0.0557 0.0280
hfenergy: -740.6077568 hartree
pointgroup: C01 [X(C11H13N3O2)]
dipole: 3.2885465 1.4074954 -0.5583631 debye
polarizability: 398.9692206|9.5015611|146.8445405|-22.0810123|-21.4241317|74.0801758 unknown
InChI: InChI=1S/C11H13N3O2/c1-8(2)9(3)12-13-10-4-6-11(7-5-10)14(15)16/h4-7,13H,1H2,2-3H3
charge 0 multiplicity 1
29 atoms
O  -5.231291 0.444041 0.32284
O  -4.607801 -1.69123 0.847724
N  1.111514 0.986187 -0.180853
N  2.129573 0.074662 -0.002776
N  -4.330873 -0.47027 0.511579
C  -0.221749 0.603196 -0.004197
C  -1.247288 1.574568 -0.20283
C  -0.567493 -0.728928 0.367314
C  -2.921171 -0.101726 0.33474
C  3.385236 0.48433 -0.180284
C  -2.593702 1.225293 -0.034378
C  -1.91428 -1.077592 0.535593
C  4.421546 -0.555271 0.022345
C  3.72259 1.915702 -0.566674
C  3.940775 -1.943185 0.41616
C  5.758051 -0.302979 -0.135318
H  -0.983119 2.600008 -0.488811
H  0.231977 -1.457527 0.514504
H  -3.397047 1.951696 -0.180981
H  -2.207868 -2.091532 0.819957
H  1.305299 1.959885 -0.447511
H  3.337991 2.635463 0.184476
H  3.28214 2.181545 -1.548993
H  4.805049 2.07929 -0.642752
H  3.369098 -1.90886 1.360499
H  3.258718 -2.355352 -0.348514
H  4.794441 -2.629992 0.540546
H  6.49438 -1.097832 0.020898
H  6.162504 0.673411 -0.419604
