program: Gaussian 09
title: 000263842
version: EM64L-G09RevD.01
frameworkgroup: C1[X(C20H24N2O13S)]
method: RPBEPBE
basis: SDD
operation: Freq
keyword: #p
keyword: freq=noraman
keyword: PBEPBE/SDD
title: #p freq=noraman PBEPBE/SDD
converged: YES YES NO NO
title: Mulliken charges:
elementType: S O O O O O O O O O O O O O N N C C C C C C C C C C C C C C C C C C C C H H H H H H H H H H H H H H H H H H H H H H H H
charge: 0.956675 -0.225624 -0.267383 -0.308675 -0.252255 -0.268867 -0.511068 -0.521524 -0.225182 -0.251037 -0.256789 -0.260928 -0.196570 -0.196101 -0.589441 0.027477 -0.087655 -0.150715 -0.114420 -0.069212 -0.110605 -0.378243 -0.047793 0.298438 0.343039 0.322341 -0.759321 -0.213910 -0.203139 -0.766558 0.326627 -0.752806 -0.332135 -0.349956 0.397130 -0.758288 0.329154 0.315855 0.311066 0.271127 0.343504 0.360627 0.245495 0.273036 0.246881 0.258628 0.253815 0.294655 0.339660 0.291426 0.247576 0.249305 0.245479 0.248589 0.260307 0.297144 0.299731 0.247854 0.246818 0.276738
chargesum: 0.00000
title: Mulliken charges with hydrogens summed into heavy atoms:
elementType: S O O O O O O O O O O O O O N N C C C C C C C C C C C C C C C C C C C C
charge: 0.956675 -0.225624 -0.267383 -0.308675 -0.252255 -0.268867 -0.511068 -0.521524 -0.225182 -0.251037 -0.256789 -0.260928 -0.196570 -0.196101 -0.228814 0.027477 0.228201 0.178438 0.196646 0.201914 0.232899 0.140289 -0.047793 0.298438 0.343039 0.322341 0.000003 0.080745 0.136521 0.021749 0.326627 0.001569 -0.034990 -0.050225 0.397130 0.013121
polarizability: 3.60765381e+02 2.12783863e+01 3.06374006e+02 1.97816710e+01 -5.78832516e+00 2.44047067e+02
1716.lowfreq: -7.4613 -3.8157 -0.0012 -0.0005 0.0007 5.0658 14.3113 19.1064 29.9465
frequency: 14.0784 17.9113 29.8683 31.7034 35.3526 40.2907 41.8218 45.1838 53.3470 54.9330 63.6766 65.3983 67.0466 72.1465 74.3101 78.2039 84.3487 88.6511 94.9869 97.1205 99.6793 116.2610 117.5043 121.8785 152.5878 160.8458 181.0078 190.4987 197.3972 203.7653 207.5279 213.4761 241.9959 243.2697 264.5922 278.4887 279.5721 292.5646 306.0260 331.5406 349.1400 368.9191 381.3018 391.1647 411.1803 412.5960 419.1949 454.0646 463.3871 480.8197 498.9932 502.8302 506.1859 518.3610 538.6290 554.0517 558.8833 565.0608 569.8187 574.4518 606.4724 607.9652 612.7309 626.8812 645.5467 657.4239 663.4053 680.8723 736.0952 754.7854 776.3077 783.7529 791.3954 807.8389 818.7185 836.8231 848.0152 857.0292 860.1092 873.9222 876.3840 894.8711 932.7817 943.0328 953.6788 965.0564 973.9400 989.8920 991.9592 995.1663 995.8178 999.3843 1001.8969 1007.5113 1018.5118 1041.0152 1043.7652 1046.1552 1046.7587 1049.6133 1058.6615 1067.8799 1086.0381 1097.0944 1112.3427 1137.4498 1158.5542 1171.4726 1179.6946 1181.7327 1191.0130 1208.5672 1213.6031 1218.2453 1221.7213 1259.3239 1275.6791 1289.4886 1292.0556 1316.0566 1321.2721 1337.5134 1340.2417 1355.7116 1362.9222 1369.2026 1371.0508 1383.9144 1384.4731 1386.0684 1386.5340 1392.4438 1393.4178 1424.5373 1451.0992 1451.8294 1452.1958 1453.5725 1453.9075 1455.7793 1456.2431 1457.0563 1457.4045 1472.1077 1582.0909 1607.0463 1634.3142 1652.8171 1658.6357 1664.4911 3003.7389 3004.2927 3006.1633 3006.9965 3029.9478 3046.2467 3055.5685 3056.9406 3060.2991 3066.4980 3098.4364 3099.1547 3100.2321 3101.2189 3121.3297 3139.6829 3141.8486 3141.9395 3142.9530 3161.3716 3164.4119 3189.7206 3191.6365 3371.0498
redmass: 8.8282 7.9486 5.9468 7.4216 5.5167 7.8750 5.8598 1.0950 5.3316 4.7444 1.2383 3.0920 4.8138 5.7787 8.7932 4.9343 4.4966 3.8852 1.7243 1.6602 6.0566 1.4636 3.0899 5.4968 7.9377 7.8239 9.3807 8.3232 9.7346 8.5210 8.0867 9.1085 7.5425 5.9817 4.8541 5.0496 3.7316 3.7942 6.0365 5.6405 5.5128 5.2411 10.3617 5.8475 4.3267 3.1117 5.0743 4.4665 4.0219 5.3563 4.3813 4.2411 6.9564 4.3988 3.3753 3.6062 3.6248 3.3770 3.6105 3.9056 4.8633 4.9597 7.0405 5.1277 4.5528 5.0624 4.9409 8.0327 4.1857 2.6502 4.4242 9.4049 4.3768 13.7667 4.0376 7.1626 3.9453 1.2773 4.2988 3.0570 1.8924 6.3591 4.3250 13.1032 3.4038 4.5291 3.4722 2.3272 2.1478 1.9472 2.1016 2.2180 1.4537 2.1546 2.4993 1.6583 1.6683 1.6668 1.6379 2.3477 2.3754 4.4368 4.0201 2.5684 1.3043 2.5723 2.2858 2.7294 1.2892 3.1332 2.7240 3.4122 1.6862 3.7349 2.0847 1.1648 1.3017 1.1733 1.2588 1.3270 1.2475 1.3598 1.3155 1.3685 1.3395 1.6631 6.3365 1.2347 1.2344 1.2271 1.2306 1.4037 3.1657 6.4213 1.0557 1.0535 1.0578 1.0566 1.0554 1.0569 1.0548 2.0751 1.0612 1.0832 6.0654 8.2863 9.6383 9.8400 10.1405 10.0266 1.0389 1.0390 1.0381 1.0384 1.0846 1.0567 1.0846 1.0838 1.0868 1.0904 1.0945 1.0942 1.0936 1.0930 1.1087 1.1025 1.1023 1.1025 1.1028 1.0922 1.0909 1.0948 1.0961 1.0756
irintensity: 0.1323 0.2917 0.2447 0.7020 0.4869 0.1057 0.8621 0.6023 2.7431 0.8827 0.2140 3.9097 0.2165 1.3449 0.1130 2.9859 0.1630 7.2551 0.7721 0.6894 7.4846 0.4366 3.9380 5.2502 1.2320 3.2977 4.1823 4.8256 6.2600 3.4042 6.9528 4.2583 1.9637 4.4085 3.1913 3.8663 9.1794 11.9995 5.9275 21.9340 14.4736 12.8440 51.1759 24.5106 14.3931 1.8386 16.3137 15.1377 5.6467 49.2513 68.9235 34.7531 6.1294 26.3945 15.3930 6.9608 13.9716 11.2798 3.7130 3.7476 1.4694 2.7190 1.1330 5.0408 16.0479 15.8740 24.5218 32.3544 7.4148 49.3198 13.4567 55.7740 35.2326 72.1814 64.4902 155.6255 22.4192 3.9099 37.2977 80.3991 57.6033 97.6186 29.8545 102.9041 21.2158 34.4611 93.1896 2.0456 30.1828 151.2889 37.0367 20.6920 1.4322 102.7731 54.6214 26.1556 6.1593 6.7944 26.6440 36.2678 2.8014 72.2858 8.6958 128.5248 6.9850 17.8261 15.4074 123.1985 48.7671 269.7489 515.3648 20.0765 160.4206 230.5969 113.1879 18.9910 0.5214 9.3797 0.1875 4.6613 3.4939 3.7493 12.2761 1.9027 3.2722 4.5469 60.4392 9.9990 80.7546 115.1261 40.1265 39.3140 36.3255 46.4829 7.0744 20.8673 30.7927 47.0518 8.2804 24.6115 11.4684 7.2955 5.5147 18.0198 16.9252 0.4731 157.6878 135.8530 236.6058 143.3448 2.1866 0.1732 1.2909 0.9657 5.5218 17.2323 13.4560 0.3737 0.8692 6.9332 6.5103 5.3189 4.8727 7.0469 8.2220 7.5082 5.8438 6.0261 6.7164 35.5736 5.3668 6.1436 1.1684 154.2525
temp: 298.150 k
press: 1.00000 atm
elementType: 16 8 8 8 8 8 8 8 8 8 8 8 8 8 7 7 6 6 6 6 6 6 6 6 6 6 6 6 6 6 6 6 6 6 6 6 1 1 1 1 1 1 1 1 1 1 1 1 1 1 1 1 1 1 1 1 1 1 1 1
symmnumber: 1
zpe: 1144176.8 jmol-1
zpe.correction: 0.435794 hartree
zpe.thermalcorrener: 0.474433 hartree
zpe.thermalcorrenthalpy: 0.475378 hartree
zpe.thermalcorrgfe: 0.358997 hartree
zpe.sumelectzpe: -2259.044476 hartree
zpe.sumelectthermal: -2259.005837 hartree
zpe.sumelectthermalent: -2259.004893 hartree
zpe.sumelectthermalfe: -2259.121274 hartree
dipole: -5.8627 5.2519 2.4794
dipole: 8.2523
quadrupole: -247.0820 -195.7194 -234.4593
quadrupole: -6.1332 -13.8369 -6.8475
quadrupole: -21.3284 30.0342 -8.7057 -6.1332 -13.8369 -6.8475
hfenergy: -2259.4802703 hartree
pointgroup: C01 [X(C20H24N2O13S1)]
dipole: -2.3939045 -0.0020382 2.1932671 debye
polarizability: 358.9547185|5.9839866|267.8548781|26.6994971|34.4134801|284.3768575 unknown
InChI: InChI=1S/C20H24N2O13S/c1-10(23)31-9-16-18(32-11(2)24)19(33-12(3)25)17(20(35-16)34-13(4)26)21-36(29,30)15-7-5-14(6-8-15)22(27)28/h5-8,16-21H,9H2,1-4H3
charge 0 multiplicity 1
60 atoms
S  1.492547 0.738348 -2.427455
O  -2.151081 1.658367 -0.572114
O  -0.913505 -0.368934 2.180279
O  -2.361312 -1.257355 -1.103114
O  -0.876899 2.484229 1.230603
O  -5.23402 -0.177612 0.311731
O  1.292376 2.358062 -2.444644
O  1.470321 -0.124037 -3.802917
O  1.225671 -1.276856 2.390269
O  -3.368771 -3.199626 -0.281433
O  1.374362 3.069471 1.093665
O  -5.765272 -1.259548 -1.693396
O  7.349988 -1.520663 0.217341
O  7.121246 0.410472 1.408979
N  0.265297 -0.121939 -1.352709
N  6.719408 -0.438851 0.525895
C  -0.857316 -0.639575 0.718592
C  -0.039975 0.456919 -0.024149
C  -2.333822 -0.688124 0.272631
C  -2.962627 0.712405 0.244144
C  -0.805649 1.81143 -0.122148
C  -4.347128 0.767954 -0.411736
C  3.091035 0.372655 -1.487259
C  0.213654 -0.779868 2.926225
C  -2.940528 -2.546957 -1.255254
C  0.271829 3.134253 1.686444
C  -0.019524 -0.551409 4.400039
C  3.774746 -0.808251 -1.820512
C  3.533124 1.309361 -0.538636
C  -2.992321 -2.9318 -2.708181
C  -5.880062 -1.172232 -0.450867
C  -0.016609 3.916177 2.947042
C  4.985515 -1.07653 -1.151289
C  4.743093 1.032688 0.133059
C  5.441358 -0.151788 -0.185227
C  -6.657547 -2.10281 0.445332
H  0.910248 0.615055 0.512769
H  -0.357913 -1.609496 0.547826
H  -2.901096 -1.351272 0.949019
H  -2.99687 1.083262 1.285938
H  -0.301294 2.490991 -0.830075
H  -0.573269 -0.330302 -1.927782
H  -4.779302 1.774335 -0.297946
H  -4.291022 0.49479 -1.47816
H  -0.622001 0.354694 4.569945
H  -0.578026 -1.408841 4.818467
H  0.946072 -0.480478 4.922249
H  3.378119 -1.480098 -2.587807
H  2.958373 2.215945 -0.323892
H  -3.924852 -2.515442 -3.133188
H  -3.023049 -4.027254 -2.804647
H  -2.140895 -2.517093 -3.269496
H  -0.775762 3.408128 3.562335
H  0.913248 4.062728 3.516672
H  -0.416911 4.909818 2.674124
H  5.572053 -1.974675 -1.35907
H  5.1432 1.712706 0.888825
H  -6.968073 -1.60029 1.37337
H  -7.531233 -2.498166 -0.094857
H  -6.000643 -2.953274 0.707748
