program: Gaussian 09
title: 000263778
version: EM64L-G09RevD.01
frameworkgroup: C1[X(C10H10N2)]
method: RPBEPBE
basis: SDD
operation: Freq
keyword: #pfreq=noraman
keyword: PBEPBE/SDD
title: #p freq=noraman PBEPBE/SDD
converged: YES YES NO NO
title: Mulliken charges:
elementType: N N C C C C C C C C C C H H H H H H H H H H
charge: -0.014531 -0.014509 -0.320762 -0.320471 -0.485457 -0.493895 -0.485294 -0.494159 0.418348 0.120309 -0.228059 -0.228220 0.270696 0.270776 0.264498 0.244040 0.248611 0.245585 0.264403 0.244025 0.248511 0.245556
chargesum: 0.00000
title: Mulliken charges with hydrogens summed into heavy atoms:
elementType: N N C C C C C C C C C C
charge: -0.014531 -0.014509 -0.050066 -0.049695 0.023081 0.000301 0.023134 -0.000092 0.418348 0.120309 -0.228059 -0.228220
polarizability: 1.43812589e+02 -2.53738633e-02 1.34941487e+02 -1.09659223e-02 3.97198281e+00 7.41514095e+01
1716.lowfreq: -60.7505 -9.5103 -0.0009 -0.0005 0.0002 8.7511 12.0980 69.9198 71.1080
frequency: -60.4969 69.9058 71.0999 106.7904 123.3636 135.0434 179.9172 233.3434 277.0527 291.9000 356.8411 434.7327 453.5514 489.8152 581.3954 585.2426 611.7521 712.4792 782.6531 788.6884 818.1908 821.3248 835.7748 838.2351 842.2534 893.4878 997.1815 1009.2230 1044.8420 1047.2801 1070.8698 1075.3929 1091.8484 1092.3823 1099.1467 1159.0643 1169.5892 1178.6335 1213.0436 1217.7737 1298.4829 1348.4122 1382.3130 1443.6015 1446.2680 1467.6382 1469.9271 1538.3278 2166.7257 2174.9079 3099.9616 3100.4651 3102.9165 3103.4554 3113.0857 3113.3691 3201.5602 3204.2243 3221.7805 3222.7851
redmass: 2.6215 3.1998 4.1316 4.8816 8.9122 5.1964 3.3394 6.2455 3.5650 3.5625 3.9889 4.9765 9.6160 9.8739 5.5391 11.1747 2.6021 4.5618 1.2395 1.0855 1.2550 1.4913 2.5456 5.7629 4.5566 2.9430 3.7722 1.7327 1.1617 1.1499 1.1857 1.2814 1.2166 1.2937 1.3374 3.7663 1.3932 1.3663 1.9089 3.5869 1.5539 1.8277 3.3637 1.0875 1.0840 1.2531 1.2711 9.7545 12.6268 12.6326 1.0820 1.0810 1.0531 1.0527 1.0665 1.0673 1.1174 1.1175 1.1159 1.1155
irintensity: 2.0335 1.3231 0.4475 0.5571 4.7293 1.9822 0.0761 1.9947 0.6226 0.4735 2.4013 0.3183 0.1863 0.8686 1.7775 0.0798 0.1725 2.1619 7.9551 0.5121 1.0327 7.5756 18.4747 0.6502 58.8172 5.3743 11.8268 47.5104 8.7237 9.6101 44.5874 1.6172 2.2734 0.6621 0.0340 1.8115 2.9036 0.0883 5.2226 3.0461 13.9971 3.1891 31.3130 7.5562 5.5025 0.5873 5.6066 63.4948 16.5052 35.3020 2.1336 3.8639 8.5746 13.8719 5.9729 2.8459 2.5563 0.1974 25.1580 0.5259
temp: 298.150 k
press: 1.00000 atm
elementType: 7 7 6 6 6 6 6 6 6 6 6 6 1 1 1 1 1 1 1 1 1 1
symmnumber: 1
zpe: 448727.1 jmol-1
zpe.correction: 0.170911 hartree
zpe.thermalcorrener: 0.182100 hartree
zpe.thermalcorrenthalpy: 0.183044 hartree
zpe.thermalcorrgfe: 0.133486 hartree
zpe.sumelectzpe: -495.585226 hartree
zpe.sumelectthermal: -495.574038 hartree
zpe.sumelectthermalent: -495.573093 hartree
zpe.sumelectthermalfe: -495.622652 hartree
dipole: 6.3622 0.0163 -0.0007
dipole: 6.3622
quadrupole: -82.8278 -77.3588 -68.5481
quadrupole: -0.0202 0.0173 -1.7881
quadrupole: -6.5829 -1.1139 7.6968 -0.0202 0.0173 -1.7881
hfenergy: -495.7561373 hartree
pointgroup: C01 [X(C10H10N2)]
dipole: 0.0020634 -2.5030941 -0.0019536 debye
dipolederiv: -0.2828992 0.1512254 -0.0108234 0.046951 -0.3030137 0.0134667 -0.0239093 0.0499177 -0.2399432 -0.2819436 -0.1515519 -0.0123232 -0.0464396 -0.3032187 -0.0143667 -0.0239315 -0.0502153 -0.2404846 -0.4528812 0.4089492 0.0984757 0.1285612 0.0238411 -0.0493642 0.1371695 -0.2616491 -0.0127765 -0.4513687 -0.4066268 0.0972012 -0.1279608 0.0254403 0.0492181 0.1350782 0.2580803 -0.0123431 0.0563468 -0.0248409 0.1010948 -0.1596828 0.1289507 0.0860129 -0.0263431 0.1780397 0.0295583 0.0639218 -0.0471308 0.0200097 0.0104705 -0.1793705 -0.0271111 0.005146 0.0211539 0.0956501 0.0557085 0.0258335 0.1011334 0.1582274 0.1267067 -0.0853871 -0.025431 -0.1769486 0.029899 0.0632174 0.046234 0.019853 -0.0100053 -0.1791021 0.0275553 0.0062309 -0.0189657 0.0957008 0.6644069 -0.002996 -0.0443199 -0.0011432 0.7910507 0.0010484 0.2043983 0.002083 -0.0574374 -0.01667 0.0006568 0.0439997 0.0010418 -0.5288375 -0.0008757 0.0062309 -0.0013084 0.0888764 0.142645 -0.3158194 0.0286855 -0.1577842 0.1353215 -0.0681919 0.040381 -0.1156103 0.0539841 0.140889 0.3162402 0.0303327 0.1573381 0.135671 0.0691093 0.0408445 0.1162793 0.0548699 0.0482694 0.0226801 -0.0316771 0.096225 -0.0380534 -0.075446 -0.0504066 -0.019215 -0.0085425 0.0487837 -0.023191 -0.0315022 -0.0964091 -0.0379489 0.0748156 -0.0498357 0.0193115 -0.0091445 -0.0782218 -0.0057275 -0.0141444 -0.0260294 0.0479126 0.005439 -0.0261921 -0.0200029 0.0578598 0.0585423 -0.0092015 -0.046889 -0.0155265 0.089599 0.060664 -0.0018358 0.0579591 -0.0543635 0.0502641 -0.0857041 -0.0842247 -0.0430413 0.0072292 -0.0133388 -0.0971883 -0.0186826 0.0372408 0.0696656 0.0414723 -0.0597338 0.0521474 -0.0436518 0.0609257 -0.0622675 0.0793056 0.0256357 -0.078013 0.0056982 -0.0147241 0.0262506 0.0482991 -0.0055917 -0.0269083 0.0195824 0.0577325 0.058624 0.0094004 -0.046458 0.0158659 0.0893913 -0.0610318 -0.0016412 -0.0583285 -0.0541819 0.0505584 0.0856565 -0.0844888 0.0427962 0.007591 0.0134562 -0.0974557 0.018824 0.0366744 0.0701547 -0.0412567 -0.0594772 -0.0518528 -0.0438078 -0.0610061 -0.0621333 -0.0796102 0.0255354 unknown
polarizability: 134.5313321|-0.0613717|143.8122558|6.3684936|0.0645509|74.5618981 unknown
InChI: InChI=1S/C10H10N2/c11-5-9(6-12)10(7-1-2-7)8-3-4-8/h7-8H,1-4H2
charge 0 multiplicity 1
22 atoms
N  -2.164616 2.507941 -0.644823
N  2.162157 2.509588 0.649466
C  1.251503 -0.954299 0.416692
C  -1.24891 -0.955633 -0.41745
C  2.393048 -1.176409 -0.622109
C  1.624987 -2.366015 -0.049014
C  -2.393498 -1.176195 0.618103
C  -1.622887 -2.36664 0.050011
C  0.000602 -0.243352 0.000746
C  -0.000765 1.150662 0.002586
C  -1.175707 1.901463 -0.350067
C  1.172711 1.902819 0.357143
H  1.62564 -0.65299 1.403387
H  -1.620025 -0.656675 -1.406019
H  3.412881 -0.977586 -0.283435
H  2.191652 -0.890351 -1.658524
H  0.936279 -2.879914 -0.724427
H  2.132288 -3.018814 0.667006
H  -3.412432 -0.978911 0.275853
H  -2.195587 -0.887812 1.654543
H  -0.935958 -2.8786 0.728727
H  -2.127561 -3.021376 -0.666098
