program: Gaussian 09
title: 000263774
version: EM64L-G09RevD.01
frameworkgroup: C1[X(C9H12N2O3)]
method: RPBEPBE
basis: SDD
operation: Freq
keyword: #p
keyword: freq=noraman
keyword: PBEPBE/SDD
title: #p freq=noraman PBEPBE/SDD
converged: YES YES NO NO
title: Mulliken charges:
elementType: O O O N N C C C C C C C C C H H H H H H H H H H H H
charge: -0.240126 -0.184790 -0.289865 -0.379294 -0.389840 0.272958 -0.056841 -0.354754 0.136453 0.161312 -0.719585 -0.715703 0.203249 -0.612839 0.315292 0.216372 0.283858 0.219840 0.231292 0.229642 0.231012 0.347816 0.361663 0.228960 0.272296 0.231622
chargesum: 0.00000
title: Mulliken charges with hydrogens summed into heavy atoms:
elementType: O O O N N C C C C C C C C C
charge: -0.240126 -0.184790 -0.289865 -0.031477 -0.028177 0.272958 -0.056841 -0.039462 0.136453 0.161312 0.000484 -0.023757 0.203249 0.120039
polarizability: 1.41022216e+02 -6.21680194e+00 1.15941574e+02 1.12380867e+01 -6.14437245e+00 9.52444655e+01
1716.lowfreq: -16.2555 -12.0214 -3.5580 0.0001 0.0006 0.0006 60.5945 81.3271 99.7967
frequency: 60.5898 81.3087 99.7927 131.2841 146.1895 151.4651 169.8154 183.2504 200.4154 220.5527 254.2265 288.5043 320.0750 344.0385 373.8118 391.5490 445.8607 464.0316 556.5788 593.9656 606.5508 644.6903 678.7060 701.4913 718.0298 752.3662 777.6726 792.8506 845.9883 913.0933 945.5379 957.0212 962.9909 1003.6826 1017.9924 1067.8295 1107.2268 1119.7767 1139.5366 1150.7575 1169.0226 1217.3826 1261.8404 1268.4872 1301.2886 1315.9765 1353.2803 1390.3482 1405.5352 1418.6420 1460.0297 1468.1902 1468.6019 1483.7577 1485.6005 1492.5691 1547.5986 1601.9471 1649.7324 1692.5211 2982.8005 2983.6381 2990.4639 3062.4200 3069.3811 3076.5085 3104.0297 3108.3211 3114.2423 3180.3145 3411.4833 3547.8649
redmass: 4.8618 1.0736 5.3143 3.1509 3.8593 6.6438 1.1620 1.9047 2.6810 4.4863 1.5748 5.8034 5.3095 3.6995 5.4212 3.0881 4.3460 3.2831 6.0473 4.1480 10.3602 3.6307 4.5529 2.0803 2.8182 1.3554 3.0769 3.6530 7.6666 2.8860 2.2608 2.1288 1.5250 1.4607 1.7197 3.5046 1.8831 1.3032 2.9015 1.7104 2.0802 3.2333 3.3019 2.6533 5.7708 1.7818 4.5726 1.2148 1.1983 1.1817 1.0542 1.0751 1.0765 1.0867 1.0451 1.0535 1.6482 7.6678 5.9378 10.8898 1.0351 1.0366 1.0371 1.1021 1.0989 1.0987 1.0982 1.0998 1.0988 1.0925 1.0808 1.0794
irintensity: 2.6408 0.1521 5.7954 0.5636 1.7823 5.2548 0.5839 1.1848 7.5833 0.4322 2.0046 7.1258 12.5433 6.0235 7.5012 12.3499 10.7599 3.0973 9.9779 14.4114 12.5959 17.3573 31.8004 46.7305 38.2920 66.4978 7.5012 48.3949 16.5840 11.8314 0.7870 3.0228 1.3117 16.9887 32.6438 12.5151 48.8865 0.3144 15.8311 20.4243 77.2570 37.7059 25.6392 7.7195 214.3042 15.4147 53.5064 30.5322 14.7444 30.1977 12.2357 30.7030 26.1859 5.7711 14.9378 11.5853 330.8026 50.2505 526.3210 231.8890 73.7240 17.9181 33.2516 31.3555 7.8871 26.0659 16.9843 1.8118 3.2828 1.3179 114.5602 58.0412
temp: 298.150 k
press: 1.00000 atm
elementType: 8 8 8 7 7 6 6 6 6 6 6 6 6 6 1 1 1 1 1 1 1 1 1 1 1 1
symmnumber: 1
zpe: 535119.0 jmol-1
zpe.correction: 0.203816 hartree
zpe.thermalcorrener: 0.217908 hartree
zpe.thermalcorrenthalpy: 0.218852 hartree
zpe.thermalcorrgfe: 0.163594 hartree
zpe.sumelectzpe: -684.302271 hartree
zpe.sumelectthermal: -684.288179 hartree
zpe.sumelectthermalent: -684.287235 hartree
zpe.sumelectthermalfe: -684.342493 hartree
dipole: 0.9674 -0.0609 2.9951
dipole: 3.1480
quadrupole: -84.3371 -81.0454 -87.6852
quadrupole: -3.2491 -4.2202 5.3861
quadrupole: 0.0188 3.3105 -3.3293 -3.2491 -4.2202 5.3861
hfenergy: -684.5060866 hartree
pointgroup: C01 [X(C9H12N2O3)]
dipole: 0.4218914 -0.0209995 -1.1642542 debye
dipolederiv: -0.8080904 -0.1540074 0.1740782 -0.2305364 -0.8002902 0.2879668 0.2727508 0.3262177 -0.5608485 -1.0843384 0.0517507 0.4403161 0.0944687 -0.4257258 -0.005508 0.3436606 0.0449733 -0.5301539 -0.6904492 0.0718228 -0.1829914 -0.1008856 -0.6818404 0.2582645 -0.0226027 0.3335093 -0.687506 -1.1113419 -0.1500451 0.4044293 -0.1690698 -0.5802836 0.1980412 0.4950258 0.1510359 -0.6146273 -1.0317076 -0.2950564 0.1389942 -0.1858575 -0.5819711 0.0814208 0.1225263 0.1333373 -0.488684 0.3873688 0.1985745 0.0313509 0.1761406 0.4814946 0.1263813 -0.2130517 0.1486048 0.270639 -0.6099503 -0.072789 -0.1300097 -0.1345646 -0.6628665 0.1049441 -0.2490906 0.1201535 -0.0773925 -0.3024538 0.2325683 0.1165872 0.4004802 -0.252129 -0.1329843 0.2292049 -0.0598353 -0.1215597 1.2775867 -0.004515 -0.527978 -0.0691115 1.0739699 -0.2782937 -0.5203179 -0.4638175 0.543412 1.3752412 -0.1287887 -0.6927854 0.0541876 0.8990085 -0.2847778 -0.6564291 -0.325773 0.6727898 -0.0381644 -0.0338774 -0.09287 0.0441089 -0.100222 0.0258356 -0.0545567 -0.0254513 -0.0508934 -0.0466228 0.0284005 -0.0646205 -0.0354758 -0.049678 -0.031888 -0.0189182 0.0279703 -0.0243243 1.450128 0.2379543 0.1482234 0.346708 0.7251028 -0.5067436 -0.0403087 -0.5538711 0.6869801 0.5064094 0.1138672 -0.0374977 -0.0661819 0.1253347 0.1036293 0.1068478 0.1452859 0.1446138 0.0743323 0.0319652 0.0005019 0.0078037 0.0986251 0.0375389 0.0132346 0.0406845 0.0485051 0.0341194 0.0724832 0.1070445 0.0263046 0.0388327 -0.0160549 0.1043839 -0.0554588 -0.0579045 0.086518 0.0746317 -0.0432393 0.0458557 0.1637789 -0.00035 -0.046374 0.0503331 0.0176863 -0.040628 -0.1285092 0.0164443 -0.0876282 -0.0647895 -0.0135786 0.002832 -0.0067672 0.1126116 0.0429782 0.0713047 -0.0192491 0.112781 -0.0573984 0.0607787 -0.0009565 0.0188232 0.0893406 0.0208277 0.0253524 0.1145347 0.0162428 0.0909907 -0.0326415 0.0596377 -0.0603594 -0.0679022 -0.0190487 -0.1271667 -0.0400337 -0.1224321 -0.0236005 -0.0209157 -0.015154 -0.0008038 0.0605711 0.1855984 0.0117909 0.0588475 -0.0071829 0.2467815 0.0692625 0.0651803 0.0882657 0.2790766 0.3463467 -0.0304776 -0.0144049 -0.1208136 0.2773671 0.0377397 0.0327328 0.0170901 0.2778594 -0.0960522 -0.0186807 0.0804944 0.031951 0.1062225 -0.0560922 0.1350514 -0.0573026 -0.059764 0.1342584 -0.0187973 0.0238307 0.0835189 0.0564433 0.0840913 -0.0806705 0.0586122 0.0508446 -0.0428654 -0.0597559 -0.0099976 -0.1108118 -0.1031574 -0.0960663 -0.0646384 -0.0954567 0.0866302 unknown
polarizability: 141.2894667|6.8403209|115.7278732|-9.7021229|-7.3419493|95.1909153 unknown
InChI: InChI=1S/C9H12N2O3/c1-8(2)4-5(12)11-7(14)9(4,8)6(13)10-3/h4,10-11H,1-3H3
charge 0 multiplicity 1
26 atoms
O  0.407584 2.069455 -1.32282
O  -3.197912 0.44937 1.214875
O  1.925337 -1.053268 1.36126
N  -1.57228 1.463383 -0.181593
N  2.550503 0.594003 -0.179014
C  -0.602111 -1.339803 -0.578505
C  0.207174 -0.073695 -0.058183
C  -0.997728 -0.620766 0.73483
C  -0.251478 1.254299 -0.618617
C  -2.074814 0.429408 0.665624
C  0.060852 -2.705916 -0.411595
C  -1.4479 -1.242989 -1.847597
C  1.632896 -0.220079 0.443838
C  3.97064 0.591328 0.188957
H  -0.851924 -1.152124 1.677159
H  0.68108 -2.941911 -1.296013
H  0.701185 -2.749975 0.483103
H  -0.723816 -3.481101 -0.33214
H  -1.959477 -0.275858 -1.977334
H  -0.811239 -1.413787 -2.734504
H  -2.220669 -2.033203 -1.830347
H  -2.117675 2.291377 -0.433894
H  2.198065 1.264397 -0.876962
H  4.603214 0.354093 -0.685792
H  4.122847 -0.178121 0.962163
H  4.278047 1.572984 0.594404
