program: Gaussian 09
title: 000263754
version: EM64L-G09RevD.01
frameworkgroup: C1[X(C17H22O2)]
method: RPBEPBE
basis: SDD
operation: Freq
keyword: #pfreq=noraman
keyword: PBEPBE/SDD
title: #p freq=noraman PBEPBE/SDD
converged: YES YES NO NO
title: Mulliken charges:
elementType: O O C C C C C C C C C C C C C C C C C H H H H H H H H H H H H H H H H H H H H H H
charge: -0.356319 -0.269289 0.509390 -0.229248 -0.311753 -0.511488 -0.510435 -0.528265 -0.519612 -0.089505 -0.736104 -0.753732 0.223289 0.201097 -0.347370 -0.343381 -0.222173 -0.222284 -0.223847 0.268596 0.252943 0.241633 0.243534 0.235202 0.233859 0.239149 0.236247 0.233867 0.244661 0.249218 0.207872 0.228796 0.224126 0.215566 0.214474 0.243999 0.270273 0.263253 0.232221 0.230048 0.231493
chargesum: 0.00000
title: Mulliken charges with hydrogens summed into heavy atoms:
elementType: O O C C C C C C C C C C C C C C C C C
charge: -0.356319 -0.269289 0.509390 0.039347 -0.058810 -0.026321 -0.041374 -0.052870 -0.041084 0.159713 -0.075310 -0.079693 0.223289 0.201097 -0.077097 -0.080128 0.010048 0.007763 0.007646
polarizability: 2.34206383e+02 5.90765003e+00 1.78192377e+02 2.74598342e-02 -2.06180624e-01 1.39713745e+02
1716.lowfreq: -13.4520 -0.0005 0.0003 0.0003 6.6814 9.1346 31.3811 36.6540 53.0813
frequency: 31.2026 36.6481 53.0206 67.1376 74.2035 105.5208 126.6356 149.2144 160.5110 172.3675 181.0471 205.3515 221.7501 245.8423 261.4068 278.5828 300.1363 329.7720 335.5365 371.8844 404.2796 421.0145 434.0673 449.2888 463.4149 523.6245 563.9735 614.3311 637.5170 676.9017 684.6222 701.5266 773.6787 786.3854 794.6992 807.2128 818.8503 823.2722 850.6281 855.6356 863.7070 878.2512 902.4836 911.6406 924.9419 933.8915 951.7279 964.1818 990.2478 992.8093 994.2078 1007.8776 1019.5201 1030.3314 1043.7959 1050.0535 1061.0288 1067.6615 1079.1812 1085.8265 1099.4349 1107.1148 1116.8569 1123.0872 1144.6462 1170.3244 1172.9768 1176.4684 1177.9847 1186.2249 1196.3670 1218.2876 1241.2072 1255.0712 1310.4329 1319.3649 1345.2775 1367.2732 1379.9758 1388.6940 1396.8609 1398.0551 1431.1469 1436.6180 1439.4381 1460.7281 1467.1671 1468.0500 1475.4552 1476.2388 1482.6015 1494.3599 1580.3238 1609.1328 1611.2171 2978.5009 2984.3757 3011.4175 3067.9505 3076.0366 3082.2788 3087.8904 3096.4229 3096.9856 3104.6354 3109.3494 3128.4868 3130.8764 3138.4536 3140.7665 3154.3975 3165.9699 3176.8148 3194.3046 3197.5509 3214.9140 3216.0906
redmass: 4.1267 3.7662 3.2543 2.8322 4.0420 3.9596 2.9360 3.5945 3.9187 3.8917 2.8013 3.1447 1.1577 1.0430 3.5138 3.9930 6.1194 2.8355 3.1755 3.4159 2.8336 3.3872 3.9051 3.8018 3.7335 3.3656 2.4107 6.4389 4.3541 5.1122 5.8458 1.5991 1.1338 1.2485 2.1787 2.6869 1.3295 1.4372 3.7234 3.3667 1.2449 2.8735 3.1095 3.0899 1.6352 1.6430 1.4214 1.4771 5.1845 2.1736 1.3981 1.3256 2.6805 2.5168 1.3610 1.2351 2.5002 1.2905 1.3458 1.8029 1.5938 1.6389 1.1951 1.1105 2.3286 1.4227 1.0568 1.3853 1.1724 2.0592 2.4548 1.8706 2.2039 3.0871 1.3293 1.3674 1.4214 1.7684 1.2037 9.9159 1.2900 1.4741 1.0878 2.2313 1.0871 1.3587 1.2964 1.0611 1.0758 2.1974 1.0493 1.0555 7.4506 7.9542 6.8218 1.0355 1.0358 1.0838 1.0993 1.0983 1.0996 1.0990 1.0524 1.0527 1.0615 1.0601 1.0853 1.0881 1.0894 1.0892 1.0939 1.0973 1.0978 1.1162 1.1159 1.1142 1.1142
irintensity: 0.6261 0.1194 0.8639 0.3679 0.8282 0.7164 0.0965 0.4983 0.0920 1.0640 0.5762 1.0487 0.0390 0.0203 3.0084 1.6912 7.1973 0.8931 0.6819 2.0075 0.0017 3.8008 1.1522 0.4357 1.3627 1.8952 1.3186 0.5214 2.2607 16.9330 8.2454 86.7647 5.9922 2.1861 20.8626 4.5166 4.4682 11.7439 8.4393 79.2881 0.2688 2.1127 12.3107 4.5837 14.6172 59.8776 2.3806 16.0797 3.3894 31.0380 0.9024 0.2737 61.9192 13.6186 51.3655 31.0504 199.8470 2.7881 2.3943 41.2005 3.9461 4.2158 3.9399 5.9943 5.3977 0.8180 0.0802 3.9085 58.6554 1.9740 17.2613 39.1636 100.2841 235.4960 1.9796 0.9575 0.9478 8.9607 14.3997 2.5872 16.6506 8.6859 9.0116 13.0471 10.5950 4.8406 2.3630 7.0759 1.7680 3.7525 9.2152 14.2115 67.4004 62.8352 53.6947 33.1004 31.6429 0.9687 8.9629 62.4049 29.5651 37.9854 20.6402 21.7417 12.4587 12.8063 0.0839 10.6572 3.5596 11.7812 17.5486 24.0332 9.4962 2.9905 1.5137 36.3736 14.6184
temp: 298.150 k
press: 1.00000 atm
elementType: 8 8 6 6 6 6 6 6 6 6 6 6 6 6 6 6 6 6 6 1 1 1 1 1 1 1 1 1 1 1 1 1 1 1 1 1 1 1 1 1 1
symmnumber: 1
zpe: 908115.1 jmol-1
zpe.correction: 0.345883 hartree
zpe.thermalcorrener: 0.364977 hartree
zpe.thermalcorrenthalpy: 0.365922 hartree
zpe.thermalcorrgfe: 0.298339 hartree
zpe.sumelectzpe: -809.968612 hartree
zpe.sumelectthermal: -809.949517 hartree
zpe.sumelectthermalent: -809.948573 hartree
zpe.sumelectthermalfe: -810.016156 hartree
dipole: -0.0802 1.7827 0.0953
dipole: 1.7871
quadrupole: -97.5265 -113.5834 -116.8718
quadrupole: 0.6879 0.4758 -0.4531
quadrupole: 11.8007 -4.2561 -7.5446 0.6879 0.4758 -0.4531
hfenergy: -810.3144948 hartree
pointgroup: C01 [X(C17H22O2)]
dipole: -0.0443151 0.354865 -0.6053395 debye
polarizability: 233.9550185|2.3182771|147.6262258|-6.6255957|-15.6054603|170.5312605 unknown
InChI: InChI=1S/C17H22O2/c1-12(2)17(14-8-9-14,15-10-11-15)19-16(18)13-6-4-3-5-7-13/h3-7,12,14-15H,8-11H2,1-2H3
charge 0 multiplicity 1
41 atoms
O  -0.184459 -0.046254 -0.217809
O  0.475398 -1.045177 1.800302
C  -1.686066 -0.132767 0.067362
C  -1.971747 0.570357 1.402586
C  -2.309442 0.572723 -1.141783
C  -1.635659 2.048055 1.648556
C  -3.099778 1.601632 1.59193
C  -1.692012 1.819434 -1.795935
C  -1.721686 0.485967 -2.55535
C  -2.09341 -1.648258 0.158078
C  -1.617082 -2.495649 -1.043445
C  -3.622955 -1.806471 0.35329
C  0.7516 -0.489385 0.705466
C  2.151055 -0.230767 0.23343
C  3.219192 -0.646341 1.070238
C  2.432176 0.408441 -1.002284
C  4.554769 -0.424505 0.676706
C  3.770308 0.628422 -1.393088
C  4.833392 0.213431 -0.555923
H  -1.790471 -0.083983 2.261043
H  -3.403141 0.56348 -1.093279
H  -1.260958 2.636848 0.808087
H  -1.201218 2.310256 2.617271
H  -3.6728 1.554827 2.522922
H  -3.679982 1.912133 0.718988
H  -0.716494 2.152792 -1.432231
H  -2.363144 2.622552 -2.115072
H  -2.416455 0.375489 -3.393525
H  -0.771029 -0.038897 -2.674289
H  -1.596521 -2.035862 1.067832
H  -1.847108 -3.561497 -0.858973
H  -0.528334 -2.406525 -1.203338
H  -2.126382 -2.195883 -1.976612
H  -3.860424 -2.864021 0.570197
H  -4.179549 -1.524447 -0.559889
H  -3.998352 -1.194715 1.192255
H  2.977446 -1.136995 2.018861
H  1.603498 0.725754 -1.641362
H  5.376448 -0.74639 1.325708
H  3.985689 1.122093 -2.347094
H  5.871487 0.385901 -0.861923
