program: Gaussian 09
title: 000263742
version: EM64L-G09RevD.01
frameworkgroup: C1[X(C15H10N4)]
method: RPBEPBE
basis: SDD
operation: Freq
keyword: #pfreq=noraman
keyword: PBEPBE/SDD
title: #p freq=noraman PBEPBE/SDD
converged: YES YES NO NO
title: Mulliken charges:
elementType: N N N N C C C C C C C C C C C C C C C H H H H H H H H H H
charge: 0.032350 0.040442 0.032345 0.040445 0.060261 0.189840 0.189961 0.513366 -0.694179 -0.219900 -0.218358 -0.219898 -0.218366 -0.406191 -0.406181 -0.385611 -0.386262 0.439515 -0.800492 0.247960 0.248910 0.248878 0.243820 0.243834 0.240120 0.240124 0.228447 0.228476 0.246342
chargesum: 0.00000
title: Mulliken charges with hydrogens summed into heavy atoms:
elementType: N N N N C C C C C C C C C C C C C C C
charge: 0.032350 0.040442 0.032345 0.040445 0.060261 0.189840 0.189961 0.513366 0.051569 -0.219900 -0.218358 -0.219898 -0.218366 -0.162371 -0.162347 -0.145491 -0.146138 0.439515 -0.097227
polarizability: 2.21263975e+02 5.38971536e-03 1.64486063e+02 -2.14617425e+01 -3.91287055e-04 1.33158376e+02
1716.lowfreq: -13.7453 -7.4070 -0.0005 0.0003 0.0006 4.5266 9.2115 45.5963 54.7504
frequency: -8.5965 45.5896 54.7502 67.5106 87.5671 93.6135 107.7147 125.8129 128.7682 143.9420 161.5499 200.1716 217.9860 219.8898 250.0370 272.6756 329.5478 357.9307 375.8898 403.2821 405.6263 428.3262 430.1612 454.8499 484.8704 496.1564 548.6153 571.2734 576.2568 584.3942 625.9330 666.6845 681.6916 727.5819 735.4898 775.5045 825.1849 837.7675 850.1570 956.4186 970.6239 977.9883 989.1816 1010.8350 1048.2975 1048.9856 1061.8097 1063.4190 1131.2934 1150.8287 1198.1110 1213.3469 1225.8088 1240.0613 1309.0940 1313.2557 1364.1803 1399.9769 1403.4337 1407.9571 1459.3969 1469.4351 1470.2005 1472.5243 1509.7027 1579.3390 1622.7550 2195.1235 2200.7872 2203.3050 2206.3029 2980.5676 2998.8844 3062.9066 3090.5099 3097.9940 3104.4091 3123.2433 3124.4252 3143.9601 3149.5805
redmass: 1.0384 4.3567 5.4808 6.6540 11.2280 7.8050 12.7290 7.3591 9.3666 6.3408 2.2387 1.9754 3.0053 4.6862 4.0496 5.7991 3.4482 4.0184 4.3916 6.8867 2.8806 11.3194 11.0520 11.1614 12.3641 4.2584 4.6578 5.5900 12.3619 6.1630 6.4371 9.3053 4.3633 3.1145 9.9525 4.3018 1.4779 3.7894 1.2471 1.3123 7.1284 1.4881 1.4052 3.2346 4.6049 1.5791 1.6243 1.9627 1.3204 7.0927 1.1093 9.3498 3.0211 8.8516 4.6496 1.2894 5.5495 1.2183 1.1818 3.1413 1.0457 1.0694 1.0951 1.0557 2.6326 6.0603 6.3312 12.6591 12.6361 12.6468 12.6328 1.0385 1.0357 1.0953 1.1001 1.0999 1.1009 1.0875 1.0878 1.0964 1.0976
irintensity: 0.6724 0.0645 0.4808 0.2366 1.3166 0.0136 1.7300 4.2537 6.3044 4.6042 1.5145 0.2326 2.0228 2.4985 1.3596 0.2771 0.1434 0.4169 2.1256 0.4054 0.0227 0.0950 0.1319 0.0116 0.0000 7.0076 6.5731 11.8679 1.8901 7.2011 3.3548 2.0602 13.3542 5.5719 12.8498 1.4659 39.4721 0.2580 0.3303 0.5676 5.1745 0.1822 0.1373 6.4820 14.9903 18.1462 19.1403 16.9910 5.5745 4.1387 3.2963 0.7157 2.2638 8.0171 30.6707 2.2590 1.1993 14.1556 15.6225 5.6049 13.6545 2.2753 15.6313 13.3082 22.6982 0.0027 12.5286 3.6099 1.0231 7.8981 1.3368 24.3407 3.6014 18.6313 15.4147 4.5074 13.5378 0.0430 20.7769 22.3930 0.5528
temp: 298.150 k
press: 1.00000 atm
elementType: 7 7 7 7 6 6 6 6 6 6 6 6 6 6 6 6 6 6 6 1 1 1 1 1 1 1 1 1 1
symmnumber: 1
zpe: 538923.7 jmol-1
zpe.correction: 0.205265 hartree
zpe.thermalcorrener: 0.223071 hartree
zpe.thermalcorrenthalpy: 0.224016 hartree
zpe.thermalcorrgfe: 0.159570 hartree
zpe.sumelectzpe: -795.190919 hartree
zpe.sumelectthermal: -795.173113 hartree
zpe.sumelectthermalent: -795.172169 hartree
zpe.sumelectthermalfe: -795.236615 hartree
dipole: -5.7164 -0.0006 -3.8665
dipole: 6.9013
quadrupole: -115.6588 -116.1427 -121.1099
quadrupole: 0.0050 4.2129 -0.0011
quadrupole: 1.9783 1.4945 -3.4728 0.0050 4.2129 -0.0011
hfenergy: -795.3961846 hartree
pointgroup: C01 [X(C15H10N4)]
dipole: -2.2589801 0.0228287 1.5062001 debye
polarizability: 220.9766223|0.61382|164.4772068|22.0327558|-0.5449259|133.4545849 unknown
InChI: InChI=1S/C15H10N4/c1-11-3-5-12(6-4-11)13(2)14(7-16,8-17)15(13,9-18)10-19/h3-6H,1-2H3
charge 0 multiplicity 1
29 atoms
N  3.597919 2.073946 0.763046
N  0.491194 1.96151 -2.385106
N  3.611301 -1.99883 0.844231
N  0.504507 -2.032434 -2.305632
C  0.560138 0.026846 0.771093
C  1.487305 0.818425 -0.217799
C  1.492498 -0.797467 -0.185538
C  -0.927304 0.016782 0.509582
C  0.939496 0.057536 2.252886
C  2.652777 1.500542 0.314492
C  0.929889 1.437358 -1.407362
C  2.662376 -1.450121 0.373334
C  0.939412 -1.466863 -1.349517
C  -1.646723 1.233929 0.429075
C  -1.638783 -1.207195 0.477506
C  -3.050293 1.222556 0.299699
C  -3.042409 -1.209976 0.348052
C  -3.773357 0.00249 0.251754
C  -5.280255 -0.005764 0.074354
H  2.028988 0.06536 2.423724
H  0.505122 0.957664 2.720993
H  0.512423 -0.826996 2.756081
H  -1.114939 2.192192 0.463003
H  -1.100923 -2.159941 0.549362
H  -3.592261 2.172788 0.230991
H  -3.578275 -2.165638 0.317276
H  -5.739545 -0.893894 0.542069
H  -5.745793 0.894009 0.512794
H  -5.548683 -0.024216 -0.999643
