program: Gaussian 09
title: 000263741
version: EM64L-G09RevD.01
frameworkgroup: C1[X(C15H10N2)]
method: RPBEPBE
basis: SDD
operation: Freq
keyword: #pfreq=noraman
keyword: PBEPBE/SDD
title: #p freq=noraman PBEPBE/SDD
converged: NO YES NO NO
title: Mulliken charges:
elementType: N N C C C C C C C C C C C C C C C H H H H H H H H H H
charge: 0.001965 -0.000272 0.374806 0.379453 0.378003 -0.567122 -0.442016 -0.359539 0.202451 -0.418990 -0.402731 -0.240262 -0.232790 -0.803821 0.174169 -0.270154 -0.255637 0.246058 0.246515 0.256776 0.243272 0.246430 0.235325 0.235238 0.253071 0.246080 0.273724
chargesum: 0.00000
title: Mulliken charges with hydrogens summed into heavy atoms:
elementType: N N C C C C C C C C C C C C C C C
charge: 0.001965 -0.000272 0.374806 0.379453 0.378003 -0.321064 -0.195501 -0.102764 0.202451 -0.175719 -0.156301 -0.004936 0.002448 -0.030947 0.174169 -0.270154 -0.255637
polarizability: 3.43923590e+02 -9.29196373e+00 1.74036440e+02 -2.89595098e+00 6.12344986e+00 7.97575893e+01
1716.lowfreq: -6.9451 -0.0004 0.0006 0.0007 2.6462 6.9675 30.1147 50.6875 81.9628
frequency: 30.0852 50.6741 81.9602 118.5201 132.8830 149.5043 177.9835 191.2471 204.3508 241.5315 273.1805 341.0694 388.7491 408.5987 435.3706 446.8320 471.7971 479.4278 512.2558 539.0310 553.1376 586.3708 605.7312 631.7070 654.4511 687.4568 759.1114 762.1919 771.8777 784.6242 831.4204 876.8680 890.7745 916.9339 943.1187 966.2104 982.7600 998.0706 1022.8288 1025.4433 1058.6488 1068.9842 1130.0870 1170.1501 1175.4470 1178.2074 1228.5467 1251.1635 1284.9304 1318.0298 1355.0888 1397.3277 1405.4140 1423.1845 1437.1843 1457.8124 1466.7687 1470.1640 1510.7292 1551.7525 1574.1517 1599.8982 1634.6263 2158.5919 2169.0479 2986.4582 3070.1528 3115.4769 3125.9984 3131.6915 3136.9129 3142.8668 3148.5011 3166.8837 3181.0184
redmass: 5.7766 7.4038 4.9947 2.8001 5.3025 1.6375 3.9710 4.1750 4.9813 6.9717 5.6964 3.9317 3.2940 3.8315 5.8793 9.5284 3.7051 2.8743 6.8457 5.2130 4.7113 6.1917 10.6911 6.5198 4.1601 3.5848 1.8865 2.7849 3.5903 2.6424 1.3443 1.4977 3.6018 1.6973 3.8908 1.3729 1.3871 1.3557 2.2436 1.7118 3.6055 1.8881 1.7716 2.2821 1.4899 1.2266 1.9325 1.6331 1.7200 3.7894 1.9974 1.2116 3.6429 3.5480 4.1452 1.3526 1.6535 1.1292 3.4981 5.0024 6.6643 5.5833 6.6174 12.6329 12.6369 1.0413 1.0919 1.0999 1.0865 1.0892 1.0900 1.0906 1.0950 1.1004 1.0944
irintensity: 2.0458 0.5773 1.5566 1.8504 3.8662 1.2685 1.7970 2.2454 2.0882 1.6964 0.8998 1.8299 0.9435 0.6528 1.0268 0.5936 12.2959 12.3815 0.5863 0.0797 3.3931 2.4020 0.1967 1.3480 0.8585 1.4591 26.1517 14.2225 17.7364 1.1518 44.5615 31.9400 0.4343 11.9650 2.8585 3.9227 4.4595 0.1230 2.2785 5.2161 2.4283 0.2387 12.4783 3.4795 11.5829 0.7329 19.8511 5.2210 13.5359 32.8888 10.1425 29.7388 3.9482 5.2148 4.6029 12.3283 25.6776 33.5281 0.4201 132.8852 19.1412 14.8297 19.8816 13.5136 59.9108 6.1725 8.9389 11.0244 2.5873 0.0221 7.1218 3.5214 27.6141 36.9990 3.0780
temp: 298.150 k
press: 1.00000 atm
elementType: 7 7 6 6 6 6 6 6 6 6 6 6 6 6 6 6 6 1 1 1 1 1 1 1 1 1 1
symmnumber: 1
zpe: 529993.8 jmol-1
zpe.correction: 0.201864 hartree
zpe.thermalcorrener: 0.216288 hartree
zpe.thermalcorrenthalpy: 0.217232 hartree
zpe.thermalcorrgfe: 0.159790 hartree
zpe.sumelectzpe: -685.927075 hartree
zpe.sumelectthermal: -685.912651 hartree
zpe.sumelectthermalent: -685.911707 hartree
zpe.sumelectthermalfe: -685.969149 hartree
dipole: 6.9183 -3.0135 1.1944
dipole: 7.6400
quadrupole: -116.4285 -95.2393 -101.7148
quadrupole: 5.3538 -4.1143 6.6499
quadrupole: -11.9676 9.2216 2.7460 5.3538 -4.1143 6.6499
hfenergy: -686.1289394 hartree
pointgroup: C01 [X(C15H10N2)]
dipole: -2.6560843 0.9656529 -1.0235833 debye
polarizability: 340.7053292|4.6764712|98.5073811|26.4509824|-37.7303548|158.5049091 unknown
InChI: InChI=1S/C15H10N2/c1-11(15(9-16)10-17)13-7-6-12-4-2-3-5-14(12)8-13/h2-8H,1H3
charge 0 multiplicity 1
27 atoms
N  5.451931 0.657648 -0.127642
N  2.802459 -1.855913 2.256564
C  -1.90997 0.328856 -0.617657
C  -2.322884 -0.0601 0.71608
C  0.455825 0.420369 0.127007
C  -0.526252 0.57203 -0.873897
C  -1.318812 -0.179694 1.733273
C  0.024772 0.046715 1.453613
C  1.877768 0.681497 -0.197578
C  -2.905077 0.459726 -1.64448
C  -3.710919 -0.299268 0.974071
C  -4.251391 0.218215 -1.364794
C  -4.657325 -0.164303 -0.04564
C  2.176522 1.652056 -1.325703
C  2.947393 0.06688 0.457852
C  4.311387 0.402037 0.132641
C  2.832213 -0.97349 1.447766
H  -0.236714 0.860119 -1.890401
H  -1.623113 -0.448166 2.751271
H  0.755619 -0.027303 2.262179
H  -2.593178 0.751273 -2.654395
H  -4.02138 -0.59271 1.983491
H  -5.004542 0.318771 -2.15338
H  -5.716813 -0.35179 0.159339
H  1.543547 2.552192 -1.248014
H  1.964686 1.183385 -2.306477
H  3.233543 1.958768 -1.33659
