program: Gaussian 09
title: 000263740
version: EM64L-G09RevD.01
frameworkgroup: C1[X(C14H16O3)]
method: RPBEPBE
basis: SDD
operation: Freq
keyword: #pfreq=noraman
keyword: PBEPBE/SDD
title: #p freq=noraman PBEPBE/SDD
converged: YES YES NO NO
title: Mulliken charges:
elementType: O O O C C C C C C C C C C C C C C H H H H H H H H H H H H H H H H
charge: -0.258708 -0.213499 -0.243928 -0.213373 -0.190501 -0.625071 0.416183 0.035468 0.115924 -0.735843 0.208356 -0.419558 -0.360037 -0.226526 -0.241651 -0.262707 -0.663371 0.275429 0.264640 0.233553 0.260552 0.255684 0.220482 0.223231 0.239474 0.281483 0.232348 0.236337 0.224596 0.235278 0.219575 0.247122 0.229059
chargesum: 0.00000
title: Mulliken charges with hydrogens summed into heavy atoms:
elementType: O O O C C C C C C C C C C C C C C
charge: -0.258708 -0.213499 -0.243928 0.062057 0.074139 -0.130966 0.416183 0.035468 0.115924 -0.036446 0.208356 -0.180085 -0.078554 0.005822 -0.005314 0.197167 0.032385
polarizability: 2.14571102e+02 -8.51116080e+00 1.61730846e+02 -5.52487929e+00 -2.25622104e+00 9.79727076e+01
1716.lowfreq: -7.1148 -5.6317 -0.0010 -0.0009 -0.0009 8.3494 27.2941 45.7222 48.7522
frequency: 27.0544 45.6513 48.7314 63.3190 88.3839 122.0375 152.5109 170.9883 183.4043 224.4650 230.7081 233.1902 274.5097 305.9331 330.0479 359.5114 377.2181 417.3762 433.3917 465.5518 496.6848 520.8069 573.7032 600.7261 662.9743 684.9813 706.3509 725.0106 749.7591 782.9278 808.3264 815.5451 833.0346 848.5042 888.0999 936.1935 944.7923 966.1580 978.3936 1005.5344 1012.5176 1031.4720 1053.7300 1062.2175 1089.1488 1095.1872 1120.7975 1124.1220 1132.3620 1157.3236 1173.0157 1197.5998 1211.1168 1229.0968 1252.2394 1264.4334 1279.2497 1294.7717 1311.5832 1319.7868 1348.3950 1362.1935 1389.3553 1391.2333 1393.6577 1441.6399 1456.4477 1457.7611 1462.9395 1470.1289 1477.2791 1477.6994 1485.0535 1570.8087 1587.9653 1617.6350 1630.2882 2939.4809 2973.1754 2993.3702 2993.7566 3029.0244 3030.2161 3045.2798 3086.0673 3088.8392 3093.7547 3108.4080 3119.9125 3121.9854 3137.8335 3151.5247 3166.7651
redmass: 5.0262 3.7713 3.9404 2.8931 4.5752 4.3989 3.1075 1.3002 2.0084 1.7494 3.7007 2.6222 3.3412 2.8470 4.2186 3.9911 5.2812 3.5302 3.0837 3.9184 4.2724 4.2848 5.3549 3.8404 5.0426 4.2405 5.4706 3.8636 1.8497 1.9626 2.1350 1.7133 2.5608 3.1903 1.3595 3.9937 1.4733 2.8505 1.3883 1.3444 2.8528 2.5265 1.8794 3.0071 2.2510 2.1900 2.1512 2.3572 1.9612 1.6760 1.0700 1.6154 2.2564 1.6856 1.3949 1.6188 1.1206 1.9548 1.4641 1.3310 1.4440 1.5628 6.1525 1.2429 1.2187 2.3748 1.2030 1.0953 1.0459 1.0501 1.1125 1.9572 1.0511 8.6638 7.1822 7.1041 8.6137 1.0801 1.0629 1.0361 1.0364 1.0835 1.0647 1.0936 1.0998 1.0976 1.1030 1.0988 1.1063 1.0872 1.0893 1.0937 1.1002
irintensity: 1.8695 0.5755 2.1989 0.1552 0.5803 0.7640 2.5070 0.1724 1.2695 4.5404 1.7234 0.7941 1.9111 17.4396 8.5613 9.8223 4.4026 3.0118 4.1325 2.5132 4.0566 1.6547 2.0995 3.8354 5.0675 2.2150 10.1280 2.5917 58.9303 10.2236 13.4167 6.5509 8.1594 0.2374 0.6051 5.4783 6.7227 49.2881 3.9418 0.2035 84.8015 3.3265 6.2955 1.6870 4.5239 60.4402 183.0118 72.9923 40.2816 20.9349 4.0382 10.7958 0.3979 44.5308 41.0906 55.6636 5.9176 70.8809 44.2333 4.5164 10.2431 22.5706 3.2192 2.8803 48.7353 19.9393 20.2372 17.7571 14.5921 13.4733 14.8454 8.6645 15.4896 93.2819 66.8239 36.6296 138.2443 12.4430 7.0857 2.7043 41.3231 3.0216 36.3619 18.2836 31.5924 37.0333 1.2095 11.7021 31.9405 4.6929 11.5566 9.9954 30.6279
temp: 298.150 k
press: 1.00000 atm
elementType: 8 8 8 6 6 6 6 6 6 6 6 6 6 6 6 6 6 1 1 1 1 1 1 1 1 1 1 1 1 1 1 1 1
symmnumber: 1
zpe: 703369.1 jmol-1
zpe.correction: 0.267899 hartree
zpe.thermalcorrener: 0.284154 hartree
zpe.thermalcorrenthalpy: 0.285099 hartree
zpe.thermalcorrgfe: 0.222955 hartree
zpe.sumelectzpe: -767.527590 hartree
zpe.sumelectthermal: -767.511335 hartree
zpe.sumelectthermalent: -767.510391 hartree
zpe.sumelectthermalfe: -767.572534 hartree
dipole: -0.9403 -3.1397 -1.2143
dipole: 3.4952
quadrupole: -80.0787 -103.6212 -106.0024
quadrupole: -6.7455 3.9191 2.3649
quadrupole: 16.4887 -7.0538 -9.4350 -6.7455 3.9191 2.3649
hfenergy: -767.7954893 hartree
pointgroup: C01 [X(C14H16O3)]
dipole: 0.4134342 1.3043363 0.1369624 debye
polarizability: 213.8930458|-10.7430636|146.5284886|-2.9093218|28.1181774|113.853121 unknown
InChI: InChI=1S/C14H16O3/c1-3-17-14(16)12-8-10-6-4-5-7-11(10)13(15)9(12)2/h4-7,9,12H,3,8H2,1-2H3
charge 0 multiplicity 1
33 atoms
O  3.054655 1.045371 -0.630174
O  -1.488646 -2.267769 -1.284952
O  2.666762 0.129908 1.482559
C  0.796181 0.378232 -0.106996
C  0.395492 -1.12592 -0.22495
C  -0.124476 1.098797 0.910478
C  -1.593595 0.931451 0.564502
C  -1.088635 -1.267029 -0.619742
C  -2.044284 -0.208944 -0.1628
C  1.309792 -1.93112 -1.170338
C  2.243282 0.486621 0.356608
C  -2.544097 1.898405 0.971586
C  -3.425213 -0.363864 -0.461534
C  -3.914956 1.737456 0.675741
C  -4.359935 0.599985 -0.043862
C  4.513104 1.178069 -0.306495
C  5.259064 -0.118895 -0.630381
H  0.712836 0.854939 -1.100895
H  0.47704 -1.555754 0.799827
H  0.129607 2.173822 0.964506
H  0.080517 0.67674 1.915791
H  0.908059 -2.947852 -1.308426
H  1.366254 -1.453682 -2.165377
H  2.332614 -2.004902 -0.76106
H  -2.205946 2.784299 1.522417
H  -3.730835 -1.254018 -1.021328
H  -4.635227 2.497218 0.999595
H  -5.423426 0.475378 -0.273646
H  4.840849 2.015993 -0.942009
H  4.611396 1.443693 0.760804
H  6.344287 0.028132 -0.477239
H  4.927467 -0.937383 0.030323
H  5.095715 -0.415576 -1.680731
