program: Gaussian 09
title: 000263733
version: EM64L-G09RevD.01
frameworkgroup: C1[X(C14H8N4)]
method: RPBEPBE
basis: SDD
operation: Freq
keyword: #pfreq=noraman
keyword: PBEPBE/SDD
title: #p freq=noraman PBEPBE/SDD
converged: YES YES NO YES
title: Mulliken charges:
elementType: N N N N C C C C C C C C C C C C C C H H H H H H H H
charge: 0.042178 0.033777 0.033781 0.042188 0.067745 0.189711 0.189777 -0.692712 0.498494 -0.217332 -0.218949 -0.218984 -0.217365 -0.404192 -0.404204 -0.226209 -0.226187 -0.229172 0.248794 0.249287 0.249272 0.246352 0.246378 0.238868 0.238864 0.239839
chargesum: 0.00000
title: Mulliken charges with hydrogens summed into heavy atoms:
elementType: N N N N C C C C C C C C C C C C C C
charge: 0.042178 0.033777 0.033781 0.042188 0.067745 0.189711 0.189777 0.054642 0.498494 -0.217332 -0.218949 -0.218984 -0.217365 -0.157840 -0.157826 0.012660 0.012677 0.010667
polarizability: 1.94502384e+02 -1.11347213e-02 1.56878788e+02 -1.96441184e+01 2.82763990e-03 1.23617776e+02
1716.lowfreq: -8.4777 -2.6092 -0.0005 0.0002 0.0006 4.6865 46.3509 70.3536 72.0812
frequency: 46.3456 70.3525 72.0748 90.3304 95.4822 108.2968 126.8502 132.7943 162.3108 171.2213 204.7997 228.4997 262.9928 279.8836 300.7906 361.0564 397.7843 403.1496 429.0590 433.5092 454.6038 484.8083 486.5193 562.4227 576.2800 577.5981 611.6497 622.6713 676.8349 679.8514 705.2463 735.8161 770.9072 830.1435 853.9781 928.1670 972.3112 981.5299 990.9481 1003.2273 1022.3768 1049.3128 1057.0333 1065.4245 1094.2935 1150.6179 1178.9589 1194.6821 1213.5112 1240.1292 1308.7159 1323.5765 1377.6550 1404.1397 1437.0239 1459.7125 1468.4104 1487.7385 1590.4636 1611.7371 2195.2939 2201.0595 2203.5517 2206.5253 2999.3259 3098.2155 3105.2198 3129.7495 3129.8976 3143.9084 3157.4637 3172.7028
redmass: 4.6847 7.4271 7.7276 10.4115 7.4057 13.0027 6.8525 11.3002 2.2590 5.4976 1.6503 4.8429 5.4020 5.2046 3.3820 7.0946 7.7941 2.8224 12.1593 10.5863 11.5039 12.3669 5.1775 4.0494 12.3606 11.4116 6.3146 6.7435 4.2118 8.9290 1.7483 10.0490 1.8360 3.5969 1.2457 1.3816 8.6541 1.4439 6.1187 1.3447 2.7564 3.6082 1.6282 1.9386 1.6007 6.4820 1.0526 1.1146 9.3961 9.2103 4.3773 1.3488 7.7755 1.1811 2.2126 1.0459 1.1143 2.0901 6.0565 6.0199 12.6591 12.6359 12.6470 12.6327 1.0357 1.0999 1.1009 1.0876 1.0884 1.0910 1.0959 1.1015
irintensity: 0.0020 0.2077 0.2606 1.7994 0.0343 1.4515 4.5602 9.6574 1.9409 0.9828 0.0296 1.2412 2.7984 0.3287 0.7959 1.6629 0.0096 0.0036 0.1597 0.0670 0.0000 0.0002 2.7543 14.3772 1.9435 0.3043 0.5610 7.4664 16.5833 0.0585 54.9971 12.7576 39.4330 0.2967 0.3543 0.9695 5.2980 0.0412 2.1810 0.0593 5.6508 18.6478 21.6482 11.1106 0.4555 4.0932 0.0059 0.4687 0.6339 6.0677 23.9889 2.8144 0.0154 14.9565 16.8390 11.5730 1.2658 12.5610 0.6729 0.4347 2.9482 0.7653 7.5868 1.0321 3.3680 4.3506 12.1144 5.1159 2.9059 8.3954 19.6471 14.8775
temp: 298.150 k
press: 1.00000 atm
elementType: 7 7 7 7 6 6 6 6 6 6 6 6 6 6 6 6 6 6 1 1 1 1 1 1 1 1
symmnumber: 1
zpe: 468706.0 jmol-1
zpe.correction: 0.178521 hartree
zpe.thermalcorrener: 0.195251 hartree
zpe.thermalcorrenthalpy: 0.196195 hartree
zpe.thermalcorrgfe: 0.134228 hartree
zpe.sumelectzpe: -755.960441 hartree
zpe.sumelectthermal: -755.943711 hartree
zpe.sumelectthermalent: -755.942767 hartree
zpe.sumelectthermalfe: -756.004734 hartree
dipole: -4.9809 -0.0017 -4.0123
dipole: 6.3959
quadrupole: -109.6549 -109.1991 -114.8144
quadrupole: 0.0034 6.1546 0.0007
quadrupole: 1.5679 2.0237 -3.5916 0.0034 6.1546 0.0007
hfenergy: -756.1389621 hartree
pointgroup: C01 [X(C14H8N4)]
dipole: -1.9659773 -0.0307495 -1.5703648 debye
dipolederiv: -0.1629961 0.0026843 -0.0361363 0.0173726 -0.1557122 -0.0046302 -0.0622255 0.0179204 -0.1238389 -0.1455152 0.0249014 -0.0356525 0.0104068 -0.1635287 0.0186316 0.0053582 -0.0188314 -0.1564311 -0.145664 -0.0267202 -0.0345335 -0.0102022 -0.1632839 -0.0180401 0.0059221 0.0191425 -0.1564584 -0.1632694 -0.0043671 -0.0359477 -0.0202266 -0.1561055 0.0064344 -0.061416 -0.0159632 -0.1232665 0.4167591 0.0047699 0.1828962 0.0090069 0.5611205 -0.0076243 0.3643227 -0.0081217 0.2727459 0.1303868 0.2363618 0.0069517 0.0421524 0.0910921 0.0456622 0.0167592 0.2683525 0.1462253 0.1288751 -0.2359426 0.0180152 -0.0415202 0.0780019 -0.0423958 0.0170872 -0.2650968 0.1611405 -0.1678931 -0.0002701 -0.0262026 0.0004185 -0.0553934 -0.0002501 -0.0027103 -0.0004277 -0.0734742 0.1125605 0.0000088 0.0298035 -0.0051748 -0.1035088 -0.0009118 -0.1884478 -0.0001938 -0.1390465 -0.0343679 0.092788 -0.0167414 0.0179359 -0.0579464 -0.0401201 0.0356966 -0.1248553 0.0286614 0.0478369 -0.1706606 0.0081414 -0.0797381 -0.0362193 0.0118788 -0.0781603 0.1042885 -0.0771456 0.0493597 0.1702717 -0.0000637 0.0752794 -0.0433977 -0.0135932 -0.0824592 -0.1054344 -0.0715296 -0.0349152 -0.093576 -0.0120077 -0.0163909 -0.0491563 0.0439184 0.0372774 0.1283095 0.0205556 -0.0837268 -0.1040675 -0.0064564 0.0301512 0.0340955 0.0074745 0.0118256 -0.0277979 -0.1052734 -0.0832341 0.104387 -0.0114149 -0.0287704 0.034224 -0.0139013 0.0131413 0.0211828 -0.1059354 -0.0382038 0.1058441 -0.0245228 0.0994725 0.0775347 -0.0163398 -0.0138487 -0.0231891 -0.1220982 -0.0395391 -0.1061045 -0.0194991 -0.0992549 0.0803072 0.0070979 -0.0091009 0.0138768 -0.1234946 0.1298795 -0.0013198 -0.0303273 -0.0013016 -0.050211 -0.0018132 -0.0287093 -0.0018047 -0.1322952 -0.1023845 0.0014687 0.0291545 0.0020272 0.1174336 -0.0009948 0.0526443 -0.0010633 0.0799063 0.0888514 -0.0665542 -0.0153117 -0.0710525 -0.0123166 -0.0669876 -0.0517262 -0.0350831 0.0438172 0.0898636 0.0650438 -0.0178626 0.0677774 -0.0083442 0.0695337 -0.0547049 0.0378841 0.0388154 0.0354439 0.0971292 0.0112225 0.0945927 -0.0115982 0.0059484 0.0121405 0.0090612 0.130329 0.0341948 -0.0967803 0.0157244 -0.0942365 -0.0107269 0.0005421 0.0165712 -0.0025619 0.1307372 0.0240343 -0.0706111 0.0032337 -0.0889753 -0.0443697 0.008059 0.0120894 0.01467 0.1502886 0.0250746 0.0702235 -0.000064 0.088983 -0.0460634 0.0010405 0.0078928 -0.0056206 0.1509204 -0.111411 0.0010915 0.017601 0.0012675 0.0940727 0.0013809 0.0247805 0.0013563 0.156145 unknown
polarizability: 194.3424713|-0.5953671|156.8645578|-19.9205122|-0.7006286|123.7919193 unknown
InChI: InChI=1S/C14H8N4/c1-12(11-5-3-2-4-6-11)13(7-15,8-16)14(12,9-17)10-18/h2-6H,1H3
charge 0 multiplicity 1
26 atoms
N  0.170653 -1.949645 2.392213
N  3.294859 -2.074808 -0.739484
N  3.308275 1.997112 -0.836551
N  0.18439 2.041957 2.297442
C  0.257838 -0.028327 -0.771422
C  1.178714 -0.816176 0.225396
C  1.183916 0.800058 0.18684
C  0.644288 -0.064753 -2.25129
C  -1.23287 -0.017514 -0.522069
C  0.615076 -1.430147 1.414581
C  2.346958 -1.500302 -0.298283
C  2.356578 1.45069 -0.368657
C  0.624778 1.473554 1.345534
C  -1.947142 -1.238363 -0.44112
C  -1.938995 1.210464 -0.498041
C  -3.353173 -1.229579 -0.321249
C  -3.345017 1.21652 -0.378066
C  -4.055221 -0.002779 -0.28949
H  1.734733 -0.072707 -2.415438
H  0.213435 -0.967072 -2.718433
H  0.220087 0.817667 -2.760567
H  -1.410446 -2.19407 -0.464319
H  -1.396098 2.160519 -0.565633
H  -3.897741 -2.176667 -0.248552
H  -3.883348 2.16952 -0.349532
H  -5.146026 0.003145 -0.191705
