program: Gaussian 09
title: 000263732
version: EM64L-G09RevD.01
frameworkgroup: C1[X(C13H18O8)]
method: RPBEPBE
basis: SDD
operation: Freq
keyword: #pfreq=noraman
keyword: PBEPBE/SDD
title: #p freq=noraman PBEPBE/SDD
converged: NO YES NO NO
title: Mulliken charges:
elementType: O O O O O O O O C C C C C C C C C C C C C H H H H H H H H H H H H H H H H H H
charge: -0.259894 -0.262801 -0.262807 -0.259901 -0.214067 -0.246891 -0.246874 -0.214057 0.210524 0.017287 0.017336 -0.721344 -0.721330 0.190559 0.238064 0.238026 0.190541 -0.508283 -0.500524 -0.500524 -0.508284 0.271922 0.232399 0.208492 0.271875 0.232413 0.208501 0.229760 0.241527 0.250832 0.244905 0.239340 0.243451 0.239340 0.243442 0.244914 0.250839 0.241530 0.229761
chargesum: 0.00000
title: Mulliken charges with hydrogens summed into heavy atoms:
elementType: O O O O O O O O C C C C C C C C C C C C C
charge: -0.259894 -0.262801 -0.262807 -0.259901 -0.214067 -0.246891 -0.246874 -0.214057 0.210524 0.017287 0.017336 -0.008531 -0.008541 0.190559 0.238064 0.238026 0.190541 0.213837 0.227172 0.227173 0.213846
polarizability: 1.77210713e+02 3.01054325e+00 1.65365409e+02 3.24323207e-03 2.28922447e-03 1.57870103e+02
1716.lowfreq: -9.1237 -8.5534 -2.1429 0.0001 0.0006 0.0006 29.3755 55.5652 57.7968
frequency: 29.3721 55.5627 57.7894 72.7520 73.0735 84.3596 85.2816 98.4251 98.5533 108.2836 118.8845 124.4043 125.5102 130.9947 134.9034 161.5014 180.3517 189.4715 192.7532 219.3618 226.3219 231.2805 241.8591 252.4301 274.6272 289.1435 294.3165 318.7169 321.1084 351.9958 380.7817 384.7406 405.4107 468.4695 499.5751 553.9333 624.7948 660.1548 663.3858 699.1714 728.2879 748.7350 765.3554 776.9490 794.1688 849.5097 889.1030 892.0899 918.0906 965.3320 967.6201 993.4150 1002.2292 1016.3992 1060.7630 1105.3080 1107.8355 1112.9161 1112.9888 1113.0771 1113.2555 1149.8798 1149.9010 1152.4755 1153.2106 1175.3969 1189.0418 1213.7595 1230.1269 1247.9914 1345.0893 1393.5276 1408.7490 1418.7164 1419.6384 1421.1966 1421.3306 1452.1047 1452.4836 1453.0461 1453.3277 1455.5761 1462.5083 1462.5354 1463.3239 1463.4641 1469.1470 1478.7922 1488.7525 1622.1485 1624.5593 1644.7788 1646.7143 2994.1966 2998.2322 3003.5529 3003.7266 3007.3895 3007.5481 3082.1231 3087.3237 3107.0806 3107.1850 3111.0286 3111.0646 3135.4769 3135.7273 3148.2850 3148.3982 3154.5857 3154.5898
redmass: 4.9199 4.0180 4.3488 3.9222 3.6712 3.2862 2.5449 1.1716 1.1433 1.7225 1.1920 2.1111 1.9919 3.4350 1.8330 2.5046 3.8271 2.3153 5.3517 4.6534 2.4253 5.3944 7.4824 4.4794 1.9346 4.4308 4.4840 4.9097 4.7050 3.8909 5.4095 8.7742 5.3753 3.3695 3.3293 7.2022 8.8964 7.6925 8.2984 6.1890 6.3174 6.8587 6.3445 8.0463 8.4387 8.5875 8.1010 7.5012 7.7293 2.7114 1.3565 1.5347 8.8334 8.8852 4.4076 3.2166 1.8463 1.2654 1.2850 1.2638 1.2964 1.4786 1.5037 1.4526 1.4804 6.8331 6.2851 4.1202 7.5588 5.5730 5.6239 1.1938 1.1901 1.1801 1.1976 1.1847 1.1848 1.0497 1.0497 1.0500 1.0500 1.0472 1.0504 1.0515 1.0512 1.0513 1.0498 1.0925 1.0521 9.9112 9.9020 10.2436 10.4059 1.0395 1.0396 1.0291 1.0292 1.0294 1.0294 1.0978 1.0972 1.1046 1.1046 1.1048 1.1048 1.0971 1.0979 1.1048 1.1048 1.1049 1.1049
irintensity: 1.9346 0.3365 0.1404 3.0505 3.7191 2.5102 0.0460 0.0808 0.6624 0.7472 0.0591 0.0052 0.6518 1.9218 0.1945 2.7655 0.0822 1.1917 4.1894 0.3630 0.7378 5.1020 2.0433 1.1910 2.4475 44.1286 36.1519 13.9075 1.2467 0.4228 7.5218 0.3382 0.4392 0.4842 16.9481 18.9061 2.1062 0.8630 3.2899 26.1506 0.4074 2.3960 2.4669 0.0926 3.6808 36.9574 13.6569 3.3184 1.0024 0.0283 3.8853 6.6110 44.5306 77.6698 51.4028 162.1913 229.2165 0.1464 2.4892 0.0138 14.1561 37.0175 0.4404 14.0213 34.3805 174.8075 533.1752 119.6668 33.0408 90.8335 155.4511 30.0653 10.2920 40.8670 3.7368 40.9929 7.1856 2.8845 22.2203 0.3214 24.3157 20.8798 4.9253 24.3381 0.1643 11.8563 0.0761 0.1928 28.9251 418.9930 40.0265 79.7779 152.8226 6.3002 54.4969 48.1736 17.5331 61.4900 5.1414 0.0484 29.5465 0.3216 41.7579 3.9787 37.6938 4.4225 3.6323 1.3150 28.5267 1.1143 24.6665
temp: 298.150 k
press: 1.00000 atm
elementType: 8 8 8 8 8 8 8 8 6 6 6 6 6 6 6 6 6 6 6 6 6 1 1 1 1 1 1 1 1 1 1 1 1 1 1 1 1 1 1
symmnumber: 1
zpe: 781149.8 jmol-1
zpe.correction: 0.297524 hartree
zpe.thermalcorrener: 0.322446 hartree
zpe.thermalcorrenthalpy: 0.323390 hartree
zpe.thermalcorrgfe: 0.242947 hartree
zpe.sumelectzpe: -1106.309049 hartree
zpe.sumelectthermal: -1106.284128 hartree
zpe.sumelectthermalent: -1106.283184 hartree
zpe.sumelectthermalfe: -1106.363626 hartree
dipole: 0.0006 0.0000 -2.8111
dipole: 2.8111
quadrupole: -101.6619 -125.7787 -112.3740
quadrupole: -11.2131 0.0031 -0.0038
quadrupole: 11.6096 -12.5071 0.8975 -11.2131 0.0031 -0.0038
hfenergy: -1106.6065736 hartree
pointgroup: C01 [X(C13H18O8)]
dipole: 0.0015094 -0.0009301 -1.1059867 debye
polarizability: 176.4467553|4.186745|166.1293417|0.0210779|0.0004499|157.8701285 unknown
InChI: InChI=1S/C13H18O8/c1-11(2)12(7(14)18-3,8(15)19-4)13(11,9(16)20-5)10(17)21-6/h1-6H3
charge 0 multiplicity 1
39 atoms
O  -0.953336 -1.748312 -1.323753
O  -2.988656 0.158832 -0.206391
O  2.989465 -0.160529 -0.199123
O  0.956436 1.74464 -1.324714
O  -1.515142 -2.568424 0.783308
O  -1.625726 2.026169 0.017998
O  1.625823 -2.027453 0.024344
O  1.513109 2.568548 0.782232
C  -0.001913 0.000873 1.853832
C  -0.747089 -0.232051 0.497276
C  0.746217 0.231505 0.498482
C  -0.362674 1.215654 2.71193
C  0.357059 -1.212461 2.714701
C  -1.098046 -1.645635 0.053734
C  -1.779597 0.783607 0.07367
C  1.779678 -0.784835 0.078826
C  1.098138 1.644323 0.053265
C  -1.24699 -3.084307 -1.889227
C  -4.098657 1.054388 -0.612943
C  4.100453 -1.056719 -0.601555
C  1.251063 3.079741 -1.891787
H  -0.67063 2.094131 2.128882
H  0.513401 1.509176 3.315171
H  -1.180731 0.931955 3.400172
H  0.666206 -2.091882 2.133721
H  -0.520256 -1.504981 3.316626
H  1.173711 -0.92763 3.404139
H  -1.106438 -2.968208 -2.972866
H  -2.281285 -3.3824 -1.648072
H  -0.543427 -3.823859 -1.471674
H  -3.832008 1.588933 -1.539795
H  -4.952382 0.381685 -0.771682
H  -4.308404 1.786657 0.184404
H  4.954557 -0.38426 -0.759283
H  4.308283 -1.78771 0.197469
H  3.836068 -1.592753 -1.528195
H  0.54638 3.819837 -1.477095
H  2.284736 3.378485 -1.648783
H  1.113009 2.961771 -2.975545
