program: Gaussian 09
title: 000263728
version: EM64L-G09RevD.01
frameworkgroup: C1[X(C13H16O2)]
method: RPBEPBE
basis: SDD
operation: Freq
keyword: #pfreq=noraman
keyword: PBEPBE/SDD
title: #p freq=noraman PBEPBE/SDD
converged: YES YES NO NO
title: Mulliken charges:
elementType: O O C C C C C C C C C C C C C H H H H H H H H H H H H H H H H
charge: -0.198028 -0.297783 0.076616 0.178095 0.165106 0.330139 -0.553334 -0.580427 -0.750109 -0.746227 0.219771 -0.441979 -0.391586 -0.246960 -0.540643 0.241543 0.233066 0.233114 0.249910 0.270542 0.236233 0.211287 0.212448 0.245495 0.248885 0.237808 0.240125 0.226046 0.222704 0.243549 0.224594
chargesum: 0.00000
title: Mulliken charges with hydrogens summed into heavy atoms:
elementType: O O C C C C C C C C C C C C C
charge: -0.198028 -0.297783 0.076616 0.178095 0.165106 0.330139 -0.070311 -0.105818 -0.032046 -0.039399 0.219771 -0.204171 -0.151461 -0.020915 0.150205
polarizability: 1.69034802e+02 3.51521293e-01 1.61140918e+02 -1.95789212e+00 -1.40527447e-01 9.19298905e+01
1716.lowfreq: -2.3380 0.0005 0.0007 0.0009 5.8934 17.5929 58.2917 67.3318 100.6222
frequency: 58.2606 67.3147 100.6159 135.7153 182.1300 184.9845 212.0042 213.8832 237.3247 268.9298 272.5812 280.5503 313.5977 335.0426 360.9531 394.9477 412.1520 448.4343 518.1399 528.3726 550.1587 569.5897 587.4015 613.2912 715.1315 726.0779 744.5118 786.4969 801.3094 830.6077 873.5093 875.4718 926.6947 945.9637 962.9458 986.7388 992.0360 1025.5271 1051.5205 1066.5731 1101.0690 1111.5863 1118.9187 1127.6012 1146.3881 1158.3359 1186.4160 1190.6355 1222.9344 1235.8310 1247.6087 1272.8168 1294.8627 1347.0736 1362.0776 1370.2122 1381.5500 1433.7846 1444.3542 1449.3418 1455.2959 1461.3545 1468.5784 1469.0720 1473.0887 1477.9605 1482.4190 1493.6003 1589.5685 1601.9094 1625.7749 2961.8892 2970.3521 2987.1145 2989.3210 2996.8708 3041.3251 3051.0943 3081.2059 3084.0949 3092.2805 3118.8214 3120.8681 3123.0601 3124.3122 3146.5778 3171.4329
redmass: 5.1126 3.0414 3.5647 3.0965 1.4597 2.0095 2.8503 2.1079 1.0693 2.6911 1.9280 1.6324 3.4236 3.4243 4.3089 4.6574 3.6173 3.0691 4.2058 3.8962 3.8991 3.6964 4.0669 3.9390 3.8220 4.5619 1.7622 2.3768 2.6872 2.0752 1.4888 2.9935 2.7934 1.6532 1.3216 1.6548 2.2971 1.6285 3.9095 2.8897 2.3187 1.2574 1.9238 2.1979 1.3855 1.3555 1.3781 1.4786 2.1202 3.7734 2.1150 2.0810 1.4907 1.6883 1.1726 7.5132 1.2088 1.3203 1.1670 1.7899 1.8234 1.0566 1.2106 1.0552 1.0586 1.0936 1.1417 1.0849 6.6478 6.8357 9.8698 1.0325 1.0660 1.0439 1.0536 1.0360 1.0961 1.1040 1.0996 1.0987 1.0982 1.0993 1.0997 1.0999 1.0868 1.0933 1.0958
irintensity: 3.6263 0.9602 6.7425 1.8341 0.2956 0.8353 0.8847 1.3638 0.6305 1.7291 0.2774 0.9401 1.6612 4.1574 5.4919 2.8501 2.1996 3.2345 2.6757 0.9424 1.6697 2.5441 1.5398 9.8234 4.0051 2.6201 33.1430 34.8581 8.4261 9.3284 0.0688 2.2846 4.2252 2.7958 0.6683 26.9661 38.8885 10.9081 67.6644 35.7011 14.4056 0.1098 0.1849 7.7560 4.8882 0.6711 6.4046 23.2907 117.7132 32.8653 11.9957 2.6387 4.3556 18.9925 20.9585 1.9851 27.0086 21.0235 18.0817 39.8146 40.3224 3.6494 17.4141 12.8131 8.1159 1.6062 11.6329 15.2893 37.7662 1.3140 146.1716 70.7182 21.9200 6.7272 42.1737 23.1028 23.0862 42.4131 21.7971 26.6935 29.8510 1.8575 20.4260 9.6349 5.8531 22.9517 17.5678
temp: 298.150 k
press: 1.00000 atm
elementType: 8 8 6 6 6 6 6 6 6 6 6 6 6 6 6 1 1 1 1 1 1 1 1 1 1 1 1 1 1 1 1
symmnumber: 1
zpe: 676010.5 jmol-1
zpe.correction: 0.257479 hartree
zpe.thermalcorrener: 0.271865 hartree
zpe.thermalcorrenthalpy: 0.272809 hartree
zpe.thermalcorrgfe: 0.217313 hartree
zpe.sumelectzpe: -654.301329 hartree
zpe.sumelectthermal: -654.286943 hartree
zpe.sumelectthermalent: -654.285999 hartree
zpe.sumelectthermalfe: -654.341495 hartree
dipole: -4.1930 1.4713 0.9593
dipole: 4.5460
quadrupole: -87.8142 -84.1770 -91.2127
quadrupole: 11.1024 2.9336 -1.2862
quadrupole: -0.0795 3.5576 -3.4781 11.1024 2.9336 -1.2862
hfenergy: -654.5588081 hartree
pointgroup: C01 [X(C13H16O2)]
dipole: -1.7110887 0.1419796 0.5008335 debye
polarizability: 167.7214207|2.2343159|161.8178163|-7.2151687|-0.2258628|92.5663734 unknown
InChI: InChI=1S/C13H16O2/c1-13(2)11(14)8-7-9-5-4-6-10(15-3)12(9)13/h4-6H,7-8H2,1-3H3
charge 0 multiplicity 1
31 atoms
O  3.543976 -0.287605 -0.543623
O  -1.378262 -1.983665 0.259796
C  1.188917 -0.749604 -0.030904
C  -0.114829 0.074744 0.087757
C  2.462565 0.137715 -0.056889
C  -0.115819 1.498096 0.027614
C  2.35785 1.517692 0.569823
C  1.190294 2.270448 -0.106048
C  1.408978 -1.656773 1.234125
C  1.172122 -1.632039 -1.314213
C  -1.388076 -0.573541 0.210684
C  -1.328874 2.231146 0.091385
C  -2.595805 0.15978 0.271727
C  -2.56241 1.568597 0.209087
C  -2.660645 -2.683307 0.354961
H  1.432069 2.428247 -1.177213
H  1.078345 3.275458 0.339664
H  2.140803 1.41563 1.652089
H  3.320448 2.0424 0.451005
H  0.570909 -2.36281 1.331772
H  2.350904 -2.221435 1.119485
H  1.46832 -1.053138 2.158499
H  0.99385 -1.01425 -2.212878
H  2.150352 -2.127956 -1.42941
H  0.376921 -2.389474 -1.243229
H  -1.293566 3.325784 0.05042
H  -3.556417 -0.352929 0.368683
H  -3.497047 2.137697 0.258935
H  -3.197162 -2.422836 1.287796
H  -2.400962 -3.752451 0.364712
H  -3.305652 -2.464721 -0.517812
