program: Gaussian 09
title: 000263727
version: EM64L-G09RevD.01
frameworkgroup: C1[X(C13H16N2O5)]
method: RPBEPBE
basis: SDD
operation: Freq
keyword: #p
keyword: freq=noraman
keyword: PBEPBE/SDD
title: #p freq=noraman PBEPBE/SDD
converged: YES YES NO NO
title: Mulliken charges:
elementType: O O O O O N N C C C C C C C C C C C C C H H H H H H H H H H H H H H H H
charge: -0.236956 -0.161024 -0.405704 -0.262141 -0.202919 -0.376208 -0.631168 -0.208698 -0.081029 0.049910 -0.061228 0.161524 0.117110 0.182720 -0.439270 -0.440946 0.110845 -0.424954 -0.423871 -0.379867 0.363955 0.199610 0.210022 0.203705 0.199703 0.223631 0.352672 0.217703 0.204482 0.203735 0.230336 0.189712 0.206390 0.340029 0.375175 0.393016
chargesum: 0.00000
title: Mulliken charges with hydrogens summed into heavy atoms:
elementType: O O O O O N N C C C C C C C C C C C C C
charge: -0.236956 -0.161024 -0.012688 -0.262141 -0.202919 -0.023536 0.084035 0.155256 -0.081029 0.049910 0.138382 0.161524 0.117110 0.182720 -0.025543 -0.017612 0.110845 -0.002769 0.010201 0.016235
polarizability: 1.57122632e+02 9.14263427e+00 1.72645587e+02 4.90751437e+00 -5.01147974e-01 1.47782461e+02
1716.lowfreq: -11.5979 -5.7962 -0.0007 0.0002 0.0004 4.3450 28.6298 59.5146 66.4846
frequency: 27.7613 59.5041 66.4789 69.4842 82.8696 89.0669 105.5034 119.0156 147.5298 177.5011 182.6417 208.1981 252.2615 279.5999 303.6908 328.1024 335.0784 368.8850 394.1101 401.6043 441.4174 457.8995 477.7785 520.8258 536.1311 574.7339 584.3708 601.0515 612.8875 622.0717 652.1708 688.2606 695.2677 711.6507 713.8394 722.3395 769.7040 779.9783 798.0981 810.4299 814.9604 858.7106 862.1805 875.2463 926.4314 954.9192 981.1679 1001.4431 1016.4894 1034.3818 1051.1419 1057.6859 1077.2996 1093.8779 1103.2861 1106.1535 1114.8603 1150.8575 1156.3485 1232.7794 1247.1973 1258.1212 1258.9796 1275.7077 1279.5118 1289.1696 1311.1731 1324.6530 1330.2365 1337.9691 1339.9032 1351.2169 1352.3761 1355.5902 1372.3714 1418.4039 1459.3190 1461.2355 1472.1610 1474.8513 1484.8372 1576.6993 1635.5279 1649.3963 1661.3852 1696.9457 2964.2815 2969.5515 2971.4367 2975.0458 2981.7412 2997.9374 3025.5017 3030.1664 3032.7433 3037.2028 3047.0507 3123.7440 3426.4746 3524.9881 3546.2214 3630.7580
redmass: 4.2353 8.1178 5.1003 4.1172 8.6315 7.5519 5.9462 6.8017 4.7795 3.6609 7.0282 4.4865 3.4116 2.6731 7.5544 3.6394 2.9446 5.8681 4.2163 2.4242 3.7503 2.8395 3.6590 3.1970 2.4847 2.1885 3.4878 2.4281 3.6116 2.0798 2.7292 2.3016 3.3827 3.0060 1.5656 1.6885 5.6379 1.4736 3.3470 9.1066 2.6011 2.3667 2.4541 2.6511 1.3765 4.3584 4.1778 2.2639 2.7149 2.3997 1.7980 1.8571 1.9285 1.7560 2.1919 2.0366 1.1616 1.6575 2.5734 1.6441 1.9580 2.3678 1.3297 1.3622 2.1351 1.4705 2.2098 1.7389 1.3117 1.5184 1.8031 1.6959 1.4478 1.7107 2.7086 2.4815 1.0927 1.0837 1.0859 1.0860 1.0917 1.7779 3.2945 6.6550 6.4947 11.2698 1.0637 1.0632 1.0608 1.0648 1.0628 1.0815 1.0987 1.0965 1.0978 1.1031 1.1034 1.0867 1.0532 1.0641 1.0795 1.0982
irintensity: 0.2322 4.3688 0.2904 0.7670 0.0611 2.7014 3.6313 2.1543 0.0716 6.2728 5.1811 5.8670 2.5053 0.5762 0.9181 4.0098 5.1794 1.4829 7.1227 3.0511 1.2323 6.2783 14.6333 15.3885 48.2627 28.0287 29.9697 22.5603 58.1304 102.1429 41.4023 143.0452 39.7837 5.5258 18.6813 81.8437 26.2972 0.5846 2.0350 17.5322 1.7790 21.1045 3.8114 2.5014 5.4823 4.2407 63.7690 10.5951 8.7751 39.1827 15.4541 9.9544 76.9267 0.9488 68.9206 53.2892 11.5349 0.8811 1.4545 36.6641 35.4047 3.4886 1.4661 1.6167 72.3771 10.2592 57.7579 7.1457 0.0304 4.5360 10.5338 30.8034 2.0695 17.2952 131.1287 27.7548 7.3998 7.7453 20.8813 8.5962 6.9651 324.8760 237.9140 267.4379 300.6560 238.2719 34.2829 25.1125 10.9387 26.7744 23.7266 47.7916 52.5753 71.8376 14.9279 8.6333 122.4927 0.4117 77.4687 42.4541 68.2511 84.7695
temp: 298.150 k
press: 1.00000 atm
elementType: 8 8 8 8 8 7 7 6 6 6 6 6 6 6 6 6 6 6 6 6 1 1 1 1 1 1 1 1 1 1 1 1 1 1 1 1
symmnumber: 1
zpe: 742879.8 jmol-1
zpe.correction: 0.282948 hartree
zpe.thermalcorrener: 0.301411 hartree
zpe.thermalcorrenthalpy: 0.302355 hartree
zpe.thermalcorrgfe: 0.236030 hartree
zpe.sumelectzpe: -989.145247 hartree
zpe.sumelectthermal: -989.126784 hartree
zpe.sumelectthermalent: -989.125840 hartree
zpe.sumelectthermalfe: -989.192165 hartree
dipole: -2.8676 2.7653 0.6443
dipole: 4.0354
quadrupole: -118.6053 -118.7882 -116.0535
quadrupole: 9.5750 0.1849 3.0219
quadrupole: -0.7896 -0.9725 1.7622 9.5750 0.1849 3.0219
hfenergy: -989.4281949 hartree
pointgroup: C01 [X(C13H16N2O5)]
dipole: -1.2325643 -0.9436363 -0.3332008 debye
polarizability: 155.4660679|-6.9666444|174.1902156|-5.4557578|2.0298205|147.8943969 unknown
InChI: InChI=1S/C13H16N2O5/c14-8(16)12-7(6-4-2-1-3-5-6)13(12,11(19)20)10(18)15-9(12)17/h6-7,15,19H,1-5,14H2
charge 0 multiplicity 1
36 atoms
O  1.416094 -2.495208 -1.573342
O  1.397146 2.186471 -1.873073
O  0.367419 2.13077 1.979264
O  1.085282 -0.972165 2.548688
O  2.576158 1.8645 1.294924
N  1.391809 -0.175553 -2.025161
N  1.667974 -2.820598 1.243951
C  -0.546001 0.010153 0.223511
C  0.783058 -0.819296 0.155019
C  0.790885 0.73906 0.070064
C  -1.653075 -0.027966 -0.826263
C  1.214907 -1.305348 -1.207986
C  1.223623 1.065995 -1.354628
C  1.201564 -1.542007 1.420892
C  -2.598257 -1.241099 -0.587035
C  -2.458811 1.305517 -0.80807
C  1.364481 1.602829 1.161557
C  -3.469529 -1.08184 0.683817
C  -3.324771 1.46362 0.465254
C  -4.262722 0.247631 0.661043
H  -0.890251 0.064458 1.263722
H  -1.201738 -0.137325 -1.832591
H  -2.008485 -2.177502 -0.536371
H  -3.266392 -1.332606 -1.467292
H  -3.122997 1.311994 -1.696273
H  -1.770276 2.165567 -0.915618
H  1.657044 -0.237543 -3.011468
H  -2.832617 -1.115246 1.590764
H  -4.164526 -1.939776 0.7623
H  -3.919651 2.39403 0.390466
H  -2.672236 1.582145 1.353092
H  -4.995899 0.217747 -0.171924
H  -4.8447 0.359837 1.595892
H  1.954985 -3.349637 2.066939
H  1.704396 -3.237316 0.306279
H  0.789609 2.647005 2.717955
