program: Gaussian 09
title: 000024311
version: EM64L-G09RevD.01
frameworkgroup: C1[X(C11H11N)]
method: RPBEPBE
basis: SDD
operation: Freq
keyword: #pfreq=noraman
keyword: PBEPBE/SDD
title: #p freq=noraman PBEPBE/SDD
converged: YES YES NO NO
title: Mulliken charges:
elementType: N C C C C C C C C C C C H H H H H H H H H H H
charge: -0.030716 0.526798 -0.530356 0.409419 -0.033612 -0.521357 -0.399870 -0.404045 -0.675580 -0.316399 -0.185909 -0.371463 0.216930 0.208804 0.265767 0.233324 0.230948 0.220527 0.219032 0.227540 0.243303 0.228202 0.238711
chargesum: 0.00000
title: Mulliken charges with hydrogens summed into heavy atoms:
elementType: N C C C C C C C C C C C
charge: -0.030716 0.526798 -0.104622 0.409419 -0.033612 -0.255589 -0.166546 -0.173097 -0.008481 -0.073096 0.042293 -0.132752
polarizability: 1.95468880e+02 6.58411365e+00 1.22188368e+02 -8.37682332e+00 1.58966478e+00 6.15072993e+01
1716.lowfreq: -8.6611 -0.0007 -0.0002 0.0004 6.8945 9.7585 43.2907 87.4658 182.1240
frequency: 43.2805 87.4635 182.1220 188.8662 202.1514 284.8266 330.8797 397.5565 409.6163 463.7431 481.2373 522.6256 551.7623 605.2522 670.6081 699.6798 753.6263 777.9584 788.5984 802.4336 852.2795 883.5781 917.1881 929.4530 941.3813 970.0997 978.4127 986.2922 1028.6080 1056.9063 1068.6719 1110.8059 1158.8188 1164.0212 1232.7626 1237.5436 1243.3413 1271.2058 1310.7778 1346.5617 1363.6587 1389.8317 1403.6333 1436.0869 1444.5965 1472.5008 1474.2630 1488.6936 1504.0394 1550.8890 1592.1789 1632.5994 2980.5314 2984.0880 3040.9887 3078.7102 3085.4695 3113.1295 3119.1777 3127.3621 3137.8860 3147.9887 3164.0693
redmass: 2.5813 3.7143 3.7363 3.3839 1.3076 1.9713 4.1736 3.7451 3.3579 3.7373 2.9727 6.5138 3.3036 7.2643 3.7253 3.7034 4.7200 1.3773 1.2244 2.3260 1.6124 3.7967 1.4881 4.4781 1.4410 1.3460 2.1329 1.3895 2.4803 1.9381 1.5740 1.7930 1.2205 1.4502 2.3003 1.5580 1.4671 1.6213 1.5233 3.5003 1.9206 1.1974 2.6372 3.9161 2.7348 1.0636 1.0541 1.0946 3.4307 7.2545 5.9073 6.9281 1.0359 1.0606 1.0998 1.1000 1.1012 1.0863 1.0885 1.0910 1.0971 1.0926 1.0989
irintensity: 0.0876 3.1657 0.2810 1.0314 0.5001 1.7074 0.4528 2.7434 2.0632 1.6010 8.4178 0.1140 0.4587 3.7713 7.2143 2.7603 0.7795 17.0806 5.2272 1.0986 74.7225 3.3745 16.8736 6.4083 0.3826 0.1712 2.3202 2.7226 1.9114 16.9329 2.9002 10.6318 5.1026 1.0862 2.3814 0.0218 0.9130 0.7907 1.9717 13.5885 4.7095 9.7589 4.8938 5.0995 6.1248 4.8903 11.7836 11.8682 33.3420 5.9579 8.3790 34.7168 41.4938 34.0253 6.7995 60.5299 38.3356 5.7717 18.4435 14.2543 31.6231 6.4161 31.5136
temp: 298.150 k
press: 1.00000 atm
elementType: 7 6 6 6 6 6 6 6 6 6 6 6 1 1 1 1 1 1 1 1 1 1 1
symmnumber: 1
zpe: 494448.7 jmol-1
zpe.correction: 0.188326 hartree
zpe.thermalcorrener: 0.198229 hartree
zpe.thermalcorrenthalpy: 0.199173 hartree
zpe.thermalcorrgfe: 0.152572 hartree
zpe.sumelectzpe: -479.683660 hartree
zpe.sumelectthermal: -479.673757 hartree
zpe.sumelectthermalent: -479.672812 hartree
zpe.sumelectthermalfe: -479.719414 hartree
dipole: 0.5033 2.3231 0.1527
dipole: 2.3819
quadrupole: -57.4062 -68.8464 -75.0927
quadrupole: -3.3680 -1.9216 0.1086
quadrupole: 9.7089 -1.7313 -7.9776 -3.3680 -1.9216 0.1086
hfenergy: -479.8719855 hartree
pointgroup: C01 [X(C11H11N1)]
dipole: 0.2088854 0.9016033 0.147075 debye
dipolederiv: -0.4192931 0.0466089 0.0165767 0.0157687 -0.2918934 -0.0090507 0.0183322 -0.0114499 -0.2479115 0.4323959 -0.1123625 -0.0119082 -0.1722378 -0.0062913 0.0004589 -0.0381969 0.0148621 -0.0870332 -0.0334884 0.0298028 -0.0385957 -0.0241026 0.1436235 -0.003037 -0.1802667 0.0051928 0.0964143 -0.1740603 -0.0027384 0.0095657 0.2580224 -0.1864311 -0.0512342 0.05785 -0.0374851 0.0656194 0.4125726 0.0923211 -0.0097274 -0.1807221 -0.0068546 0.0026293 -0.0598422 -0.0157503 0.0614124 -0.3002516 -0.0135343 -0.0164165 -0.0782998 0.0816292 0.0426369 0.0050671 0.0271927 -0.148753 -0.1530322 0.0972119 -0.001535 0.2024606 0.0634563 0.0227264 0.0338668 0.0240545 -0.1482007 0.0197198 0.0030345 -0.0150787 0.0249072 0.132602 0.033357 -0.0207033 0.0408879 -0.1622668 -0.0271143 0.008471 -0.0408641 0.038578 0.0742125 0.0000375 0.0854066 -0.0136765 0.0069617 0.2425336 0.0440116 -0.0193901 -0.0564776 0.1902563 0.0492891 -0.0424342 0.0420604 -0.1341225 -0.0609018 -0.0908965 -0.0244942 -0.2484877 -0.2752689 -0.0044195 -0.0387686 -0.0121588 -0.1231089 0.1806344 0.0066081 -0.0246572 0.2169711 0.3847382 0.048678 0.0068358 0.0622043 -0.0660995 0.0279339 -0.0271928 -0.0291933 0.0619592 -0.1077696 -0.114573 0.0003284 -0.0731182 0.0167632 -0.0463765 -0.0272655 0.0605276 -0.061291 -0.0105386 0.1266542 0.0735925 0.0762735 -0.0395063 0.0801188 0.0305712 0.015783 0.0713493 -0.0374173 -0.0306953 0.0195706 -0.0279938 0.1391549 -0.0477188 -0.1180585 0.0058862 -0.1101111 0.0147309 -0.0128144 0.0074795 -0.0116019 0.1387963 0.0509623 0.0704459 0.0168608 0.011052 -0.107355 -0.0328903 0.0126623 -0.0396401 0.1493366 0.1198807 0.0289244 -0.0014089 -0.013081 -0.1176188 -0.1132997 0.0016564 -0.0646172 0.0242664 -0.257257 0.080657 -0.0044143 0.0942449 0.0839308 -0.0045272 -0.0177806 -0.0073821 0.063963 0.0702202 -0.0892627 0.0730688 -0.0512633 -0.0069815 0.1114252 0.0256135 0.0788874 -0.0325269 0.0762209 0.0052277 0.0067056 0.0758249 -0.08954 -0.0375601 0.0161877 -0.0325015 0.1383778 -0.123788 0.0428908 0.0308918 0.0511932 0.0865337 -0.0154298 0.0330303 -0.0147526 0.1610606 -0.0699112 -0.1054755 0.0018174 -0.1262575 -0.0117535 -0.0083612 0.0005128 -0.0094876 0.1274026 unknown
polarizability: 195.8702563|6.1347059|121.1873422|-5.5652511|7.324964|62.1069489 unknown
InChI: InChI=1S/C11H11N/c1-2-9-5-6-10-4-3-7-12-11(10)8-9/h3-8H,2H2,1H3
charge 0 multiplicity 1
23 atoms
N  -1.609857 -1.570104 -0.201086
C  1.787979 -0.065575 -0.30425
C  3.239624 -0.493865 -0.462635
C  -0.92121 0.808194 0.064086
C  -0.619163 -0.592564 -0.155903
C  0.741855 -0.995796 -0.337632
C  1.473778 1.321676 -0.085482
C  0.158501 1.749533 0.092654
C  4.006199 -0.498763 0.887657
C  -2.294618 1.176324 0.237386
C  -3.280211 0.187935 0.190759
C  -2.885912 -1.171972 -0.03123
H  3.284128 -1.504258 -0.909431
H  3.756135 0.190205 -1.164722
H  0.932181 -2.06136 -0.505822
H  2.291967 2.052427 -0.067667
H  -0.06384 2.811999 0.252054
H  3.994493 0.502351 1.356007
H  5.060709 -0.794876 0.739311
H  3.544171 -1.207314 1.59815
H  -2.555992 2.228049 0.404806
H  -4.339715 0.430596 0.319341
H  -3.646001 -1.962142 -0.07085
