program: Gaussian 09
title: 000263711
version: EM64L-G09RevD.01
frameworkgroup: C1[X(C12H16N2O5)]
method: RPBEPBE
basis: SDD
operation: Freq
keyword: #p
keyword: freq=noraman
keyword: PBEPBE/SDD
title: #p freq=noraman PBEPBE/SDD
converged: NO YES NO NO
title: Mulliken charges:
elementType: O O O O O N N C C C C C C C C C C C C H H H H H H H H H H H H H H H H
charge: -0.171181 -0.190720 -0.304592 -0.242625 -0.190590 -0.169424 -0.385579 0.279904 -0.024652 -0.019664 0.130059 0.137465 -0.729614 -0.689957 0.142582 0.140156 -0.602576 -0.608428 -0.498298 0.231304 0.238621 0.225877 0.242005 0.233149 0.226976 0.262076 0.256319 0.247749 0.359417 0.223869 0.277436 0.232618 0.260232 0.244212 0.235875
chargesum: 0.00000
title: Mulliken charges with hydrogens summed into heavy atoms:
elementType: O O O O O N N C C C C C C C C C C C C
charge: -0.171181 -0.190720 -0.304592 -0.242625 -0.190590 -0.169424 -0.026162 0.279904 -0.024652 -0.019664 0.130059 0.137465 -0.033812 0.012173 0.142582 0.140156 0.163568 0.125495 0.242020
polarizability: 1.58960425e+02 -3.07337110e+00 1.62424732e+02 3.81233409e-01 -9.77510190e-01 1.46435694e+02
1716.lowfreq: -11.3521 -5.2092 -4.5087 -0.0005 -0.0002 0.0003 37.2661 45.7769 47.3099
frequency: 37.1753 45.7766 47.2993 68.5499 75.4927 86.4559 89.4256 100.1860 114.9340 125.9361 133.8818 141.9189 158.0820 186.1745 213.5095 218.5966 220.2648 248.9852 262.0607 270.2414 285.4179 307.8150 314.1990 342.6360 366.4043 380.4525 426.1467 457.4784 510.5420 568.1632 585.2379 634.8668 649.6228 678.1789 695.1916 711.6446 748.9651 784.7098 799.8266 822.0017 863.7579 891.5701 959.0489 962.7151 965.5722 977.3855 1011.2401 1029.3745 1066.5442 1098.1800 1113.5968 1118.9066 1124.8655 1129.3341 1140.8863 1147.5958 1170.6579 1220.2277 1248.9209 1254.6225 1280.5301 1340.0155 1358.0597 1396.1275 1411.3509 1418.9991 1422.0073 1431.5317 1452.3304 1458.0353 1460.4466 1461.8898 1464.1629 1468.8788 1480.6515 1482.8681 1484.6264 1486.2265 1534.8774 1614.1475 1632.5218 1658.1523 1686.0663 2981.0265 2994.7329 3001.4332 3004.1855 3010.9188 3061.3794 3084.3558 3096.6244 3098.3799 3102.3137 3106.1700 3112.4243 3117.8702 3126.2381 3154.8404 3464.9432
redmass: 1.0206 4.9565 4.6735 7.7392 2.6390 1.3574 1.0803 2.8748 4.4510 5.0956 2.0379 4.3296 1.4628 1.6026 4.6516 4.4181 3.1847 3.8499 1.7874 3.4546 4.4678 4.0678 6.1399 4.3553 8.1922 4.9738 4.7758 3.3987 3.2926 8.1718 10.8662 6.8531 4.6591 7.6930 1.3510 5.7017 4.5605 6.7148 6.8343 7.2093 7.2037 5.6575 2.0022 1.7172 3.7986 2.5983 1.7237 3.6304 4.6343 4.0191 1.2737 1.3296 2.1540 1.3431 1.7824 1.4470 3.0562 3.7672 4.1850 3.3046 4.3196 6.6855 4.7373 1.2384 1.1951 1.1746 1.1794 1.2224 1.0504 1.0494 1.0541 1.1028 1.0791 1.0472 1.0504 1.0680 1.0923 1.0458 1.5267 9.0809 8.9877 10.8629 10.9739 1.0351 1.0366 1.0359 1.0335 1.0291 1.1021 1.0996 1.1011 1.1003 1.0990 1.0992 1.0986 1.1050 1.1023 1.1056 1.0803
irintensity: 0.0838 5.8066 1.1328 1.7955 0.5035 0.4293 0.0581 1.1908 1.3985 8.4324 2.6487 1.4904 2.7929 0.6670 3.4703 3.3630 0.8547 2.7988 1.2446 4.3445 18.1817 3.7369 6.6428 6.5329 5.0798 5.1420 20.0634 0.5624 0.5971 8.8380 3.5059 5.7877 12.7604 1.2701 83.8532 26.9200 6.0470 1.5634 7.1962 4.6645 5.0621 1.3021 4.7589 1.0995 4.8872 62.8498 53.8903 11.9097 159.3552 48.9316 0.4204 0.6975 56.0275 0.2619 22.8117 32.1362 12.6622 83.5926 7.8338 58.4984 108.8603 153.0276 103.7293 20.1766 9.7528 31.8400 20.3438 80.8194 11.7682 1.4169 11.3691 20.1988 28.7988 15.0958 6.3194 12.6932 1.3870 14.9945 126.0788 102.2638 545.6598 287.5935 23.3476 62.5464 19.5425 11.2497 24.9697 26.7867 29.1541 7.1697 12.8118 10.9737 17.6752 25.6015 2.3952 16.4608 0.7349 10.5761 93.7210
temp: 298.150 k
press: 1.00000 atm
elementType: 8 8 8 8 8 7 7 6 6 6 6 6 6 6 6 6 6 6 6 1 1 1 1 1 1 1 1 1 1 1 1 1 1 1 1
symmnumber: 1
zpe: 710652.3 jmol-1
zpe.correction: 0.270673 hartree
zpe.thermalcorrener: 0.291920 hartree
zpe.thermalcorrenthalpy: 0.292864 hartree
zpe.thermalcorrgfe: 0.220166 hartree
zpe.sumelectzpe: -951.071219 hartree
zpe.sumelectthermal: -951.049973 hartree
zpe.sumelectthermalent: -951.049029 hartree
zpe.sumelectthermalfe: -951.121727 hartree
dipole: -1.9651 2.5438 -1.9459
dipole: 3.7575
quadrupole: -94.1818 -135.0780 -104.7830
quadrupole: -3.3195 9.7028 -5.6882
quadrupole: 17.1658 -23.7304 6.5646 -3.3195 9.7028 -5.6882
hfenergy: -951.3418925 hartree
pointgroup: C01 [X(C12H16N2O5)]
dipole: -0.7333826 -0.8224137 0.9854894 debye
polarizability: 158.9001985|2.7615337|161.368154|-1.6307511|-4.0896736|147.5524989 unknown
InChI: InChI=1S/C12H16N2O5/c1-10(2)11(6(15)13-3)7(16)14(4)8(17)12(10,11)9(18)19-5/h13H,1-5H3
charge 0 multiplicity 1
35 atoms
O  1.899464 2.368122 0.671955
O  1.758433 -2.313261 0.855912
O  -1.443055 -1.463189 1.327928
O  -1.092163 2.758791 -0.976509
O  -1.567915 -2.399007 -0.804966
N  2.119724 0.025853 0.859997
N  -1.832791 1.49069 0.844959
C  0.412755 -0.016784 -1.62079
C  0.209296 0.811503 -0.31507
C  0.175814 -0.741344 -0.256596
C  1.470793 1.217356 0.433597
C  1.411333 -1.153064 0.531851
C  1.766136 -0.085995 -2.322577
C  -0.760047 -0.000966 -2.601253
C  -0.967454 1.773003 -0.193501
C  -1.023291 -1.611643 -0.008687
C  3.401908 0.027951 1.572602
C  -2.978168 2.353025 1.159364
C  -2.501724 -2.40706 1.775287
H  1.813123 -0.995171 -2.948313
H  1.881682 0.791682 -2.983111
H  2.62509 -0.10566 -1.632562
H  -0.670809 0.88357 -3.255611
H  -0.745867 -0.91514 -3.219445
H  -1.741033 0.051675 -2.102162
H  3.604462 -1.002147 1.905462
H  3.345168 0.70501 2.440392
H  4.215974 0.373937 0.912305
H  -1.683581 0.63135 1.386395
H  -3.934792 1.811397 1.038703
H  -2.960711 3.205265 0.461658
H  -2.910869 2.73571 2.193986
H  -2.147474 -3.442739 1.649254
H  -3.421031 -2.258299 1.184857
H  -2.661877 -2.16912 2.835887
