program: Gaussian 09
title: 000263710
version: EM64L-G09RevD.01
frameworkgroup: C1[X(C12H15NO2)]
method: RPBEPBE
basis: SDD
operation: Freq
keyword: #p
keyword: freq=noraman
keyword: PBEPBE/SDD
title: #p freq=noraman PBEPBE/SDD
converged: YES YES NO NO
title: Mulliken charges:
elementType: O O N C C C C C C C C C C C C H H H H H H H H H H H H H H H
charge: -0.331873 -0.274279 -0.461328 -0.147987 0.574595 -0.729261 -0.821713 0.478934 0.274254 -0.727931 -0.442135 -0.355334 -0.195869 -0.210082 -0.257936 0.259045 0.230498 0.234184 0.224977 0.229197 0.226921 0.239344 0.325912 0.236618 0.220802 0.221016 0.299333 0.225767 0.225921 0.228408
chargesum: 0.00000
title: Mulliken charges with hydrogens summed into heavy atoms:
elementType: O O N C C C C C C C C C C C C
charge: -0.331873 -0.274279 -0.135415 0.111058 0.574595 -0.039602 -0.126252 0.478934 0.274254 -0.270511 -0.221119 -0.056001 0.029899 0.015839 -0.029527
polarizability: 2.04919472e+02 1.02123798e+00 1.44542581e+02 -6.88545074e+00 -4.83566576e+00 9.07947273e+01
1716.lowfreq: -22.2561 -6.7872 -2.8000 -0.0006 -0.0005 -0.0004 21.0343 30.9725 45.9225
frequency: 18.4724 30.7449 45.6585 71.0006 86.4672 99.0934 171.2616 191.8050 207.4505 243.9686 250.9047 268.1066 303.7701 336.6819 344.6073 408.1247 430.6624 509.2651 523.6299 538.8537 596.6760 615.1865 637.4098 695.4086 698.5900 704.3204 723.1234 763.8809 765.8503 801.3478 841.0972 864.4958 912.9610 941.9152 962.5578 970.7320 971.7149 985.4236 988.2251 995.8376 1024.9127 1028.9051 1051.0534 1075.5972 1090.3677 1131.2662 1159.2441 1172.4605 1190.1261 1258.6618 1302.3479 1309.8233 1326.2606 1332.6113 1385.7189 1386.7004 1390.1887 1432.2963 1437.7705 1459.1687 1464.9833 1474.9824 1483.5876 1485.8428 1513.5906 1600.4515 1617.5103 1662.9175 1669.2726 2973.1261 2995.0433 3046.8630 3050.3961 3090.3514 3090.8732 3094.4529 3101.9730 3113.2151 3131.9139 3143.7845 3164.9118 3189.2510 3195.2643 3542.5336
redmass: 3.7503 4.4540 2.9113 7.5568 5.0299 4.1815 1.0759 2.8995 2.3911 2.0114 2.0950 3.1769 4.3210 3.6659 6.5922 2.9212 2.3877 2.8272 3.2019 3.1338 4.1647 5.9610 1.2761 2.5923 3.3558 6.0927 1.2817 2.6786 1.6835 3.8202 1.2652 4.7987 1.4324 1.8117 1.3312 1.3569 8.7115 6.0926 1.2920 1.3046 1.9064 2.1239 1.5484 1.5713 1.5580 2.6135 3.2564 1.0506 1.1123 2.0681 2.4827 1.4841 1.3966 1.2508 5.5839 1.2824 1.2600 2.3207 1.1846 1.0504 1.0525 1.0519 1.0630 2.1956 2.2662 5.3714 6.0236 8.4914 5.1094 1.0373 1.0356 1.0871 1.0961 1.0918 1.0700 1.0991 1.1001 1.0881 1.0869 1.0935 1.0996 1.0953 1.1143 1.0759
irintensity: 0.0809 0.9871 0.0607 2.8405 1.5543 0.4989 0.7251 1.6426 6.1922 2.5977 2.7828 6.4664 0.4759 4.6170 3.6221 0.0159 3.7133 25.6000 2.0623 22.7330 2.5797 0.3891 32.2361 3.4918 70.7087 12.4925 2.1087 4.4414 103.0295 37.4061 0.3699 1.4708 13.5885 15.4912 56.4635 0.5615 328.3626 21.8736 4.6322 2.3819 126.6275 3.9709 7.3314 99.5244 19.7110 23.0907 348.5498 0.5861 4.8591 5.3609 2.2501 6.7367 53.3095 2.5940 55.9320 22.7874 27.7281 124.4145 1.5646 10.3648 20.3169 19.8122 5.3786 10.7163 532.9034 30.0139 102.4342 204.2004 2.2160 21.4494 18.8384 4.0714 25.4489 28.4716 2.1636 31.4084 21.9816 14.0386 0.6351 32.2419 23.8607 6.3382 19.0290 26.4526
temp: 298.150 k
press: 1.00000 atm
elementType: 8 8 7 6 6 6 6 6 6 6 6 6 6 6 6 1 1 1 1 1 1 1 1 1 1 1 1 1 1 1
symmnumber: 1
zpe: 642154.5 jmol-1
zpe.correction: 0.244584 hartree
zpe.thermalcorrener: 0.259844 hartree
zpe.thermalcorrenthalpy: 0.260788 hartree
zpe.thermalcorrgfe: 0.200065 hartree
zpe.sumelectzpe: -670.364068 hartree
zpe.sumelectthermal: -670.348808 hartree
zpe.sumelectthermalent: -670.347863 hartree
zpe.sumelectthermalfe: -670.408586 hartree
dipole: 0.9290 -2.3982 0.6165
dipole: 2.6447
quadrupole: -76.7459 -84.7951 -91.0329
quadrupole: -0.2371 -1.0995 -1.0677
quadrupole: 7.4454 -0.6038 -6.8416 -0.2371 -1.0995 -1.0677
hfenergy: -670.6086514 hartree
pointgroup: C01 [X(C12H15N1O2)]
dipole: -0.3347229 -0.7257378 -0.6662862 debye
polarizability: 205.3192253|1.0906545|129.1862797|-1.9227557|24.8366458|105.7512759 unknown
InChI: InChI=1S/C12H15NO2/c1-9(2)10(3)15-12(14)13-11-7-5-4-6-8-11/h4-8,10,13H,1H2,2-3H3
charge 0 multiplicity 1
30 atoms
O  -1.608443 -0.808996 0.025265
O  -0.492549 0.886653 1.241517
N  0.629185 -0.634125 -0.191873
C  -2.943911 -0.274354 0.49329
C  -3.503105 0.645211 -0.588026
C  -3.791894 -1.514741 0.793296
C  -3.864295 0.016605 -1.920125
C  1.995736 -0.267006 -0.050831
C  -0.473627 -0.07683 0.436554
C  -3.647483 1.971807 -0.332019
C  2.950767 -1.013506 -0.792865
C  2.427246 0.795967 0.786272
C  4.322216 -0.702362 -0.699752
C  3.804843 1.093116 0.867771
C  4.760077 0.354334 0.132493
H  -2.751942 0.308911 1.411325
H  -3.883205 -2.163779 -0.094371
H  -3.332678 -2.10301 1.60592
H  -4.805588 -1.20953 1.109446
H  -4.716572 -0.683285 -1.821798
H  -4.13965 0.784241 -2.662771
H  -3.01222 -0.565941 -2.318065
H  0.414921 -1.413433 -0.817843
H  -3.353492 2.405178 0.630959
H  -4.050332 2.661563 -1.083219
H  2.619024 -1.835877 -1.43995
H  1.690809 1.368456 1.353752
H  5.047467 -1.286345 -1.277238
H  4.131728 1.91439 1.515584
H  5.825567 0.596286 0.205402
