program: Gaussian 09
title: 000263694
version: EM64L-G09RevD.01
frameworkgroup: C1[X(C11H14N2O3)]
method: RPBEPBE
basis: SDD
operation: Freq
keyword: #p
keyword: freq=noraman
keyword: PBEPBE/SDD
title: #p freq=noraman PBEPBE/SDD
converged: YES YES NO NO
title: Mulliken charges:
elementType: O O O N N C C C C C C C C C C C H H H H H H H H H H H H H H
charge: -0.222771 -0.246833 -0.272248 -0.381801 -0.375193 0.359146 -0.548961 -0.531647 -0.441984 -0.436316 0.102458 -0.489200 0.075346 0.158805 0.254367 -0.612781 0.218694 0.286758 0.265724 0.236310 0.208457 0.225837 0.217449 0.223897 0.291774 0.346321 0.356960 0.229427 0.269823 0.232182
chargesum: 0.00000
title: Mulliken charges with hydrogens summed into heavy atoms:
elementType: O O O N N C C C C C C C C C C C
charge: -0.222771 -0.246833 -0.272248 -0.035480 -0.018233 0.359146 -0.043509 -0.029613 -0.007691 0.005029 0.102458 -0.197426 0.075346 0.158805 0.254367 0.118651
polarizability: 1.87107901e+02 -6.31769501e+00 1.45509033e+02 -1.04782313e+01 -5.53425799e+00 9.24454059e+01
1716.lowfreq: -21.9291 -10.8330 -0.0008 -0.0008 -0.0004 2.3879 44.9804 57.2387 65.9743
frequency: 44.7375 57.1754 65.9593 90.9900 92.5025 120.5505 135.0891 151.3878 173.9072 210.7075 238.5768 268.1921 305.3017 318.0715 350.2294 380.2196 406.5866 468.9417 540.4496 579.5175 587.0608 612.4045 640.6520 663.4438 704.1996 732.9291 749.9100 763.5879 790.4230 822.2582 855.1367 869.9748 900.8743 905.6431 913.6267 952.5603 959.2907 998.8034 1034.7822 1049.3486 1094.1543 1119.0272 1134.3183 1148.2851 1151.1237 1174.0940 1177.6991 1198.5571 1213.6389 1219.7138 1234.5991 1249.5998 1268.4318 1289.9991 1297.3719 1311.3901 1313.1366 1315.5061 1419.1734 1430.7881 1442.6102 1468.3428 1472.1302 1480.7144 1485.4601 1542.8575 1623.1130 1643.6848 1663.6863 1680.7966 2980.9234 2983.1704 2984.2079 2988.9426 2996.8418 3002.1435 3040.7611 3064.2076 3064.5178 3069.1029 3081.2095 3114.4895 3409.5274 3556.1434
redmass: 4.2459 3.8835 4.6667 2.5158 1.1422 4.4507 3.6348 4.3046 8.6585 4.1817 1.6004 4.7572 6.3630 4.4964 5.4736 6.6312 6.2197 2.8065 4.9738 2.2361 3.9316 8.3121 4.1595 2.5856 1.4608 2.5660 1.9743 2.3693 2.4855 2.9071 1.9862 5.6952 1.5313 2.5340 3.9664 2.6469 2.0646 1.3448 4.7591 1.9597 2.3774 1.2992 1.3814 1.6958 1.5206 4.9177 1.5190 1.4679 1.7059 1.5365 2.4567 3.3622 1.3679 1.5261 3.2100 1.5834 1.6063 1.7930 1.1724 1.0813 1.0792 1.1058 1.0837 1.0977 1.0464 1.5473 8.2613 7.4492 8.2544 11.2171 1.0692 1.0592 1.0550 1.0613 1.0672 1.0627 1.0985 1.1022 1.0920 1.0988 1.1040 1.0990 1.0805 1.0795
irintensity: 0.7550 3.0194 2.6795 0.9060 0.3510 0.8410 1.3617 3.4540 12.6909 0.4808 0.0886 9.3934 9.5307 4.6972 5.9313 8.9837 28.0092 1.5643 1.6124 0.3371 25.0680 13.3982 8.8508 16.9800 62.8305 41.7135 63.6860 110.4685 17.5837 1.7263 6.3099 3.8669 2.2074 4.0670 3.4373 17.6338 12.1966 3.5204 36.6321 6.8610 41.5960 0.7830 0.3756 76.3226 12.6920 154.6847 56.5352 0.4559 12.6834 15.3985 41.1964 47.0935 10.4094 13.1170 132.0670 5.5054 1.6253 11.4214 30.4293 6.7415 25.0673 48.3722 9.5509 5.6928 14.7783 277.9690 75.6655 353.8928 475.9352 42.3814 6.9490 56.1539 23.2970 13.0317 34.4650 39.3850 22.2006 31.3723 7.8541 32.8870 47.9266 3.7424 101.4915 66.4365
temp: 298.150 k
press: 1.00000 atm
elementType: 8 8 8 7 7 6 6 6 6 6 6 6 6 6 6 6 1 1 1 1 1 1 1 1 1 1 1 1 1 1
symmnumber: 1
zpe: 628674.6 jmol-1
zpe.correction: 0.239450 hartree
zpe.thermalcorrener: 0.254742 hartree
zpe.thermalcorrenthalpy: 0.255686 hartree
zpe.thermalcorrgfe: 0.196243 hartree
zpe.sumelectzpe: -761.594997 hartree
zpe.sumelectthermal: -761.579704 hartree
zpe.sumelectthermalent: -761.578760 hartree
zpe.sumelectthermalfe: -761.638203 hartree
dipole: -0.4267 -1.6304 1.8818
dipole: 2.5262
quadrupole: -86.9144 -97.0218 -95.1646
quadrupole: -0.1703 4.7712 -1.5111
quadrupole: 6.1192 -3.9882 -2.1310 -0.1703 4.7712 -1.5111
hfenergy: -761.8344462 hartree
pointgroup: C01 [X(C11H14N2O3)]
dipole: 0.0002149 -0.714552 -0.6908056 debye
polarizability: 186.4055855|-2.237055|145.4507677|-15.2082613|3.6160908|93.2059865 unknown
InChI: InChI=1S/C11H14N2O3/c1-12-9(14)8-7(6-4-2-3-5-6)10(15)13-11(8)16/h8,12-13H,2-5H2,1H3
charge 0 multiplicity 1
30 atoms
O  -0.735559 2.805142 0.533931
O  3.073493 0.672183 -1.206563
O  0.480575 -2.104241 0.920973
N  1.322519 1.977971 -0.302648
N  2.541989 -1.925354 -0.163391
C  -1.712128 -0.037005 -0.117874
C  -2.164364 -1.434188 -0.508679
C  -2.913326 0.751156 0.394227
C  -3.711688 -1.343183 -0.578071
C  -4.052254 -0.298292 0.516341
C  -0.437057 0.448356 -0.230726
C  0.79534 -0.28327 -0.744759
C  -0.060133 1.848663 0.07403
C  1.883713 0.809902 -0.803842
C  1.256174 -1.519878 0.108466
C  3.153892 -3.08509 0.49692
H  -1.690427 -1.793602 -1.441568
H  -1.838872 -2.132281 0.287407
H  -2.689124 1.293049 1.328506
H  -3.175239 1.537765 -0.343187
H  -4.030964 -0.970396 -1.570492
H  -4.198721 -2.319437 -0.411459
H  -4.018705 -0.776016 1.513956
H  -5.053461 0.149224 0.392291
H  0.646892 -0.668982 -1.7742
H  1.835749 2.857998 -0.214102
H  3.117049 -1.314759 -0.761581
H  3.516732 -3.815251 -0.249037
H  2.388317 -3.563046 1.12815
H  4.002085 -2.777539 1.135978
