program: Gaussian 09
title: 000263672
version: EM64L-G09RevD.01
frameworkgroup: C1[X(C10H15Cl)]
method: RPBEPBE
basis: SDD
operation: Freq
keyword: #p
keyword: freq=noraman
keyword: PBEPBE/SDD
title: #p freq=noraman PBEPBE/SDD
converged: YES YES NO NO
title: Mulliken charges:
elementType: Cl C C C C C C C C C C H H H H H H H H H H H H H H H
charge: -0.085419 -0.295089 -0.283043 0.486018 -0.497603 -0.506053 -0.512420 -0.512999 -0.361768 -0.444226 -0.560772 0.238102 0.260707 0.238307 0.245273 0.224219 0.231803 0.238321 0.225018 0.230894 0.232790 0.216148 0.207372 0.267165 0.262689 0.254566
chargesum: 0.00000
title: Mulliken charges with hydrogens summed into heavy atoms:
elementType: Cl C C C C C C C C C C
charge: -0.085419 -0.056987 -0.022335 0.486018 -0.014024 -0.050031 -0.049082 -0.049316 -0.145620 0.030311 -0.043516
polarizability: 1.19626267e+02 -2.69728492e+00 1.11069651e+02 -1.21418181e+01 1.35113062e+00 1.04684077e+02
1716.lowfreq: -15.5028 -13.4368 -7.4534 -0.0023 -0.0009 0.0016 19.5967 44.1088 49.7559
frequency: 17.5825 43.7925 49.7117 64.8007 123.4496 162.6179 170.6135 223.1507 273.2129 299.7912 337.0406 435.7785 451.1289 506.2241 592.9837 625.8279 701.9507 778.5420 793.8724 809.3722 817.1094 833.6042 840.2673 857.6273 888.6768 921.7076 931.2713 934.6074 1003.3352 1035.5588 1042.8461 1048.9734 1056.1857 1065.6878 1069.8727 1095.7886 1098.6074 1101.1942 1147.7170 1167.5198 1169.8309 1176.6796 1191.3696 1202.3610 1233.7529 1292.0353 1298.5957 1332.3369 1354.1477 1399.5527 1439.6914 1440.9091 1446.1243 1446.2158 1466.8087 1469.1813 1677.5589 2939.8115 3044.4197 3071.2762 3082.6814 3089.2696 3091.4205 3093.4270 3096.7717 3100.4821 3106.3043 3128.3683 3186.8341 3191.7193 3205.7167 3210.5545
redmass: 4.6264 4.1833 3.3522 2.6582 3.0918 2.6929 3.4738 2.6948 3.1568 3.5319 2.6261 2.6674 2.5643 2.8124 4.9998 2.8700 2.2496 1.1497 1.1381 1.2252 1.2349 1.8905 2.8705 1.8788 2.8680 1.8832 3.2076 2.6761 2.1493 1.3829 1.6522 1.2215 1.4807 1.2451 1.2543 1.1609 1.1789 1.3832 2.1218 1.3943 1.4452 1.7034 1.3132 1.8638 1.4721 1.1796 1.2729 1.4499 1.8251 2.1174 1.0887 1.0885 1.0895 1.0980 1.3115 1.3200 7.9706 1.0686 1.0572 1.0882 1.0839 1.0531 1.0802 1.0605 1.0748 1.0655 1.0720 1.1109 1.1171 1.1166 1.1151 1.1152
irintensity: 1.3170 0.8400 0.9628 0.2825 1.8406 0.3646 0.5983 0.2189 2.3467 0.1617 1.5818 3.6836 1.0824 7.6331 24.4669 3.4260 0.9031 2.9639 2.7342 5.3907 8.9538 41.2412 8.0720 4.1406 17.2557 6.6506 1.2380 5.9145 14.4540 21.2423 12.0014 32.5105 12.6637 11.1633 10.2228 0.8575 0.6577 4.6693 0.7782 2.1847 0.5948 4.0875 1.3467 0.1089 6.8772 16.0217 3.9342 4.2074 0.1914 10.9826 9.4753 5.8595 11.3159 7.1927 2.5191 3.1560 5.8306 34.6301 43.4466 0.3574 7.1631 17.7919 17.4980 29.4950 20.3891 13.0060 15.6036 25.2383 0.0652 0.9583 32.4082 29.3247
temp: 298.150 k
press: 1.00000 atm
elementType: 17 6 6 6 6 6 6 6 6 6 6 1 1 1 1 1 1 1 1 1 1 1 1 1 1 1
symmnumber: 1
zpe: 580761.9 jmol-1
zpe.correction: 0.221201 hartree
zpe.thermalcorrener: 0.233524 hartree
zpe.thermalcorrenthalpy: 0.234468 hartree
zpe.thermalcorrgfe: 0.180104 hartree
zpe.sumelectzpe: -849.175581 hartree
zpe.sumelectthermal: -849.163258 hartree
zpe.sumelectthermalent: -849.162313 hartree
zpe.sumelectthermalfe: -849.216677 hartree
dipole: 0.4550 0.6614 1.7609
dipole: 1.9352
quadrupole: -72.4343 -74.3919 -73.3251
quadrupole: -2.6016 -7.4305 -1.9062
quadrupole: 0.9495 -1.0081 0.0587 -2.6016 -7.4305 -1.9062
hfenergy: -849.3967812 hartree
pointgroup: C01 [X(C10H15Cl1)]
dipole: 0.0274293 0.2246563 0.7269616 debye
dipolederiv: -0.2349852 -0.0087235 0.0307455 -0.0403374 -0.2231498 -0.079281 -0.0833497 -0.1196199 -0.552864 0.0702028 0.0597194 0.0211404 0.1044997 -0.2268418 -0.0910439 0.1482405 -0.0899747 0.0931678 0.1141634 -0.0133064 -0.0250833 0.0264803 -0.1508164 -0.0352186 0.0185234 -0.0485829 0.0656606 0.2095356 -0.2327974 -0.1510062 -0.0915616 0.2937277 -0.0582628 -0.237189 -0.2363555 -0.0059129 0.0385944 0.034363 0.0266984 -0.0546161 0.0657763 -0.0151534 0.035517 -0.0511566 -0.1593257 0.0753301 0.0345925 0.0616293 0.0084225 -0.1580229 0.09543 -0.00776 0.1572902 -0.0512672 -0.1879323 -0.0791458 -0.0234479 -0.0539472 0.0014669 -0.0382508 -0.017675 -0.0296652 0.1108184 -0.0918049 0.1012839 0.0576148 0.1021321 -0.0935212 -0.0685335 0.0541732 -0.0440877 0.072828 -0.0480984 0.0342499 0.0225147 -0.1412129 -0.1069772 -0.1838878 0.0382874 -0.1062374 -0.1848356 0.028108 0.0103933 0.0099895 -0.1400982 0.0041759 0.0087625 -0.1043338 -0.0272695 -0.000139 0.188463 0.0232582 -0.0297406 0.1157474 0.239853 0.1185941 0.0604811 0.1283059 0.7211408 -0.108766 -0.0479755 -0.03227 -0.042226 -0.0241731 -0.0562109 -0.060352 -0.0244353 0.0909398 0.1011184 -0.0235845 -0.0186216 -0.0692472 -0.0257774 -0.0151463 0.0067223 0.0063511 -0.0874027 -0.0955915 0.0425774 0.1015553 0.058079 0.0870884 -0.0328945 0.0768298 -0.0372998 0.0050952 -0.00979 -0.0228948 -0.0930669 -0.0102621 0.119664 -0.0020397 -0.0518453 -0.0197509 -0.0231826 -0.0568019 -0.1081812 0.0509881 -0.0445997 0.0674167 0.0413895 0.0227648 0.0592801 0.0566913 -0.038321 0.0828615 -0.0914712 0.065829 0.0175249 0.0688303 -0.070401 0.0864909 0.0340165 -0.0244548 -0.0741509 0.0500173 -0.0780579 0.0469898 0.0688261 0.0854014 0.0905364 -0.0143032 -0.0157792 -0.0069815 -0.0645788 0.0328879 0.1155798 0.0612991 -0.1007228 0.0476912 -0.0395795 0.0375141 0.056329 0.0723204 0.0329219 0.0931032 0.0294326 0.0878332 -0.0083789 -0.0684697 0.0412392 0.1050993 -0.0253868 0.0889566 -0.0398472 0.0657293 -0.0360586 0.0919868 0.0086171 0.0432088 -0.0253426 0.0131826 0.0253487 -0.0995546 0.1246445 0.0311484 0.113839 0.0797239 -0.0642554 0.0011745 0.0305676 0.0362677 0.0907017 -0.0662665 0.1096226 -0.0590743 -0.1193928 0.0901039 -0.0019873 -0.0192022 0.0446735 -0.055568 0.0470586 -0.0208286 0.087175 0.0543142 -0.1620789 0.0583406 0.0169959 0.0877518 0.053825 -0.0262807 -0.0109767 -0.024467 -0.0202886 0.1010778 0.0008289 0.0079156 -0.0638318 -0.0926439 0.0384737 0.0259473 0.057409 -0.0660501 unknown
polarizability: 123.7814185|-0.9053637|110.558226|-9.0190866|0.3713809|101.0403502 unknown
InChI: InChI=1S/C10H15Cl/c11-7-1-2-10(8-3-4-8)9-5-6-9/h2,8-9H,1,3-7H2
charge 0 multiplicity 1
26 atoms
Cl -2.667336 -0.697024 -1.755209
C  1.724776 -0.824383 0.285141
C  0.676654 1.343496 -0.483935
C  0.505428 0.056343 0.289215
C  1.904917 -1.864725 -0.85136
C  1.692577 -2.323475 0.59858
C  1.772164 2.354046 -0.0948
C  0.290409 2.71952 0.082993
C  -0.668608 -0.326772 0.868822
C  -1.998291 0.391188 0.782623
C  -3.083818 -0.436408 0.078458
H  2.650926 -0.302759 0.557904
H  0.531718 1.22419 -1.566503
H  2.896456 -1.976016 -1.300272
H  1.066365 -1.987995 -1.54338
H  0.734853 -2.792724 0.84032
H  2.544496 -2.749258 1.136855
H  2.337255 2.841072 -0.894945
H  2.350722 2.159867 0.814285
H  -0.090747 2.760286 1.108186
H  -0.149232 3.45735 -0.59537
H  -0.687852 -1.279951 1.418272
H  -2.38816 0.593878 1.805813
H  -1.893331 1.363948 0.275323
H  -4.059254 0.074209 0.075045
H  -3.180388 -1.452303 0.49274
