program: Gaussian 09
title: 000263666
version: EM64L-G09RevD.01
frameworkgroup: C1[X(C10H10O)]
method: RPBEPBE
basis: SDD
operation: Freq
keyword: #pfreq=noraman
keyword: PBEPBE/SDD
title: #p freq=noraman PBEPBE/SDD
converged: YES YES NO NO
title: Mulliken charges:
elementType: O C C C C C C C C C C H H H H H H H H H H
charge: -0.226435 0.302783 0.034332 -0.372389 -0.359646 0.343685 -0.231156 -0.228530 -0.227972 -0.787423 -0.666976 0.266897 0.270972 0.231073 0.232983 0.232985 0.263010 0.232877 0.214419 0.226555 0.247956
chargesum: 0.00000
title: Mulliken charges with hydrogens summed into heavy atoms:
elementType: O C C C C C C C C C C
charge: -0.226435 0.302783 0.034332 -0.105492 -0.088674 0.343685 -0.000084 0.004452 0.005013 -0.077117 -0.192465
polarizability: 1.47135106e+02 -1.93349444e+00 1.14055085e+02 2.79197255e+00 2.06180265e-01 6.27132958e+01
1716.lowfreq: -8.8030 -6.0266 -0.0009 -0.0003 -0.0002 4.9689 53.1982 77.8209 122.1990
frequency: 53.1512 77.7609 122.1980 129.4943 188.0845 269.4415 300.0225 342.8808 399.6019 407.1049 436.5223 529.2871 601.0163 614.4400 650.4431 694.7778 707.3121 753.2983 814.7063 864.2354 901.5047 944.9952 970.5572 979.4849 989.0597 992.5697 1005.6356 1012.6384 1032.6872 1052.3311 1084.8430 1174.2646 1186.5752 1202.2128 1315.7568 1324.4228 1382.6899 1390.6771 1422.2472 1433.7708 1448.8127 1473.3908 1475.8615 1536.2525 1585.8548 1607.2376 1635.3510 2985.6448 3068.4591 3096.7958 3102.7027 3127.9592 3138.4477 3150.8503 3159.9556 3169.4338 3202.9549
redmass: 4.1419 2.8240 4.5880 1.1086 4.1663 3.9503 3.9357 3.6980 4.1980 2.8830 3.2610 3.4381 3.3655 6.3071 1.6249 3.5252 2.1932 1.5665 2.6472 1.2517 3.5037 1.4227 1.3723 1.7174 5.5141 1.3912 1.3431 1.8107 1.8644 1.5110 1.5869 1.0595 1.2129 2.5733 1.4389 3.4891 8.0001 1.2313 1.2717 2.1428 1.0483 1.0795 2.2317 8.9126 6.1411 6.0502 4.6095 1.0370 1.0955 1.0623 1.1009 1.0851 1.0883 1.0926 1.0959 1.1011 1.1139
irintensity: 3.8327 0.1460 1.6047 0.7300 0.4385 4.6194 0.0822 6.7140 1.0058 0.5244 4.0907 5.3248 7.8985 0.8221 13.2550 5.5299 47.4512 59.8832 3.8688 2.1670 12.7484 12.3191 46.6411 22.4281 2.4976 4.7967 1.8365 19.5587 5.7724 5.2076 8.2430 0.8679 34.2648 62.3988 5.2005 77.9488 3.3264 25.9971 7.3155 18.7127 17.7173 22.4525 1.4309 152.2450 7.1745 11.2259 12.5916 19.2486 14.3671 7.7774 15.9996 0.0227 7.7461 15.7987 21.4212 17.0158 17.9592
temp: 298.150 k
press: 1.00000 atm
elementType: 8 6 6 6 6 6 6 6 6 6 6 1 1 1 1 1 1 1 1 1 1
symmnumber: 1
zpe: 440947.5 jmol-1
zpe.correction: 0.167948 hartree
zpe.thermalcorrener: 0.178129 hartree
zpe.thermalcorrenthalpy: 0.179073 hartree
zpe.thermalcorrgfe: 0.131894 hartree
zpe.sumelectzpe: -461.480466 hartree
zpe.sumelectthermal: -461.470286 hartree
zpe.sumelectthermalent: -461.469342 hartree
zpe.sumelectthermalfe: -461.516520 hartree
dipole: 1.1239 -2.9308 0.3950
dipole: 3.1637
quadrupole: -54.4727 -65.3508 -66.8023
quadrupole: 4.9384 0.4704 2.4034
quadrupole: 7.7359 -3.1422 -4.5937 4.9384 0.4704 2.4034
hfenergy: -461.6484145 hartree
pointgroup: C01 [X(C10H10O1)]
dipole: -0.4684037 -0.9375342 0.6714946 debye
dipolederiv: -0.7889006 -0.0362343 0.0782769 -0.1550415 -0.7550033 0.2291673 0.2347847 0.2350599 -0.4733234 -0.6602533 -0.0418639 0.0641369 -0.0128181 -0.0608187 0.0310863 0.0580733 0.0510866 -0.0330225 1.5133442 -0.2267734 -0.0797553 -0.0471566 0.7986229 -0.3271415 -0.1841375 -0.3539418 0.347068 0.0944962 -0.0365939 0.0898718 0.1450701 -0.0912486 -0.0517525 -0.0717768 -0.0255441 -0.0211735 0.0474331 0.0708399 -0.105492 -0.1018473 -0.0692628 -0.0828449 0.0587397 -0.0614346 0.0083127 0.0444405 0.3646446 0.0026349 0.3916592 -0.1595063 0.1488405 0.0182536 0.0608916 -0.0837006 -0.1782023 0.0607372 -0.0971688 0.062443 -0.0915332 -0.1159592 -0.1238882 -0.1005407 0.0491773 -0.0519856 -0.0753218 0.1653947 -0.0816663 -0.1250536 -0.0599008 0.1637334 -0.0614651 -0.0208371 0.1292366 0.0300588 -0.0159014 0.022535 -0.1036781 -0.0616109 -0.0155337 -0.0712329 -0.0131532 -0.124427 -0.1248948 -0.0065519 -0.0939889 -0.0340107 -0.0013019 -0.049299 0.0616135 0.0357314 -0.09034 -0.0030513 0.0758614 -0.1763807 -0.0581116 -0.0866399 0.1499844 -0.072015 -0.2720998 0.0379993 0.0227238 -0.0938886 0.0186007 0.0922896 0.0613509 -0.091056 0.0389479 0.0365814 0.1032441 -0.0360757 0.0575386 0.0027949 0.115062 0.07804 0.026494 0.0559434 0.0287006 0.0490014 -0.0271604 0.0503046 -0.0485891 0.1062375 0.1020186 0.0684481 0.1016545 -0.0444799 -0.0217407 0.0395127 -0.0899783 0.0468393 0.1234133 0.0699624 -0.1002801 0.0735198 0.0056185 -0.1213503 -0.0287343 0.0278852 -0.030178 0.1393508 0.0311286 0.0293619 0.0273746 0.1029821 0.1020863 -0.044173 0.0114123 -0.0501374 0.0898703 0.064149 0.0717422 0.0622267 -0.0146868 0.06216 0.0064056 0.028444 -0.01913 -0.0008343 -0.1203878 -0.022025 -0.121414 -0.0080493 -0.0573427 0.0567887 -0.0433551 0.1507274 -0.0252973 0.0517762 -0.0754451 0.0334097 0.0891139 -0.0464179 0.1033596 -0.0678628 0.0791106 0.0321246 0.0419878 -0.0922507 0.0539378 0.1423589 -0.0424814 -0.0741943 -0.0518071 -0.1028462 0.0773874 -0.0019682 -0.0539231 0.0119222 0.1388814 unknown
polarizability: 147.2142589|2.6804908|89.5773085|1.1183658|-25.6117263|87.111919 unknown
InChI: InChI=1S/C10H10O/c1-8(2)10(11)9-6-4-3-5-7-9/h3-7H,1H2,2H3
charge 0 multiplicity 1
21 atoms
O  1.466056 1.397382 -1.217867
C  -0.336238 0.113287 -0.273639
C  1.122956 0.392883 -0.515283
C  -0.815855 -0.520923 0.904493
C  -1.271657 0.582421 -1.236733
C  2.19569 -0.503329 0.054194
C  -2.203176 -0.69538 1.105034
C  -2.653833 0.393496 -1.042656
C  -3.124071 -0.247867 0.129843
C  3.546802 0.148776 0.266822
C  1.979643 -1.838564 0.23827
H  -0.10841 -0.84747 1.673266
H  -0.888257 1.096654 -2.124317
H  -2.564926 -1.173091 2.022241
H  -3.36572 0.747245 -1.796474
H  -4.199673 -0.389159 0.284936
H  3.873566 0.651778 -0.660375
H  3.485568 0.936354 1.041565
H  4.307821 -0.588874 0.571211
H  2.788471 -2.500209 0.570957
H  1.013541 -2.308212 0.026612
