program: Gaussian 09
title: 000263640
version: EM64L-G09RevD.01
frameworkgroup: C1[X(C8H9BrO2)]
method: RPBEPBE
basis: SDD
operation: Freq
keyword: #p
keyword: freq=noraman
keyword: PBEPBE/SDD
title: #p freq=noraman PBEPBE/SDD
converged: NO NO NO NO
title: Mulliken charges:
elementType: Br O O C C C C C C C C H H H H H H H H H
charge: -0.003667 -0.206652 -0.189072 -0.227172 -0.127875 -0.293641 -0.103297 -0.471000 -0.505335 -0.516813 0.160776 0.283788 0.285774 0.289750 0.304963 0.257729 0.237801 0.247052 0.252757 0.324133
chargesum: 0.00000
title: Mulliken charges with hydrogens summed into heavy atoms:
elementType: Br O O C C C C C C C C
charge: -0.003667 -0.206652 -0.189072 0.056617 0.157899 -0.003892 0.201665 0.024530 -0.005526 -0.192680 0.160776
polarizability: 1.33118286e+02 -9.66133939e-01 8.30981951e+01 8.01690009e+00 -1.85874132e-01 7.45485044e+01
1716.lowfreq: -16.7372 -10.3025 -0.0007 0.0002 0.0003 19.6254 81.5518 144.8382 171.3494
frequency: 81.5326 144.8315 171.3310 222.4528 281.7016 326.4525 387.5950 457.1014 517.6647 573.7807 637.5500 682.3061 713.3763 758.3130 772.5554 834.8975 860.0548 870.6274 887.1833 933.9669 934.9476 941.0887 951.4801 968.9712 995.5778 1013.7620 1053.7087 1079.3660 1120.7707 1128.1422 1148.5029 1171.2650 1199.9665 1209.3748 1241.5213 1249.9583 1268.2375 1271.0648 1275.6992 1281.8756 1309.6311 1316.7220 1462.8828 1477.1417 1715.2034 3016.8602 3028.9126 3078.9314 3095.5429 3096.7268 3099.2490 3103.9410 3108.7907 3126.5242
redmass: 9.3450 6.5240 6.5766 5.7459 2.9480 4.7369 2.9680 2.7919 5.7356 4.2706 6.4042 6.9284 5.9376 3.6737 4.5568 3.5619 3.1433 2.5902 3.0453 2.1090 3.0267 2.5522 3.2772 2.0630 1.6988 2.1390 1.6416 1.5470 1.1415 1.8109 1.7559 1.2877 1.3587 1.6942 1.6003 1.4187 1.3935 1.5213 1.3694 1.4526 1.4828 1.6116 1.0830 1.0939 12.4637 1.0604 1.0607 1.1042 1.0907 1.0881 1.1036 1.0900 1.0919 1.0923
irintensity: 2.7852 2.9002 0.4067 4.4443 2.5529 3.7329 1.3071 3.5896 2.5170 0.7530 26.3057 5.3284 23.3866 6.9084 7.4733 22.4004 55.7976 12.9356 3.4642 0.8069 23.7653 54.5622 41.4248 28.4885 17.8193 7.7867 26.7103 6.8535 2.7095 12.1229 33.2185 3.0067 14.2079 1.3175 6.3910 3.0843 3.9788 1.2138 13.7063 15.3900 2.7519 5.3879 18.2931 10.5283 376.2898 24.1777 25.4952 10.1577 2.7387 18.1722 18.6064 17.7174 10.1791 5.5852
temp: 298.150 k
press: 1.00000 atm
elementType: 35 8 8 6 6 6 6 6 6 6 6 1 1 1 1 1 1 1 1 1
symmnumber: 1
zpe: 410663.7 jmol-1
zpe.correction: 0.156414 hartree
zpe.thermalcorrener: 0.164980 hartree
zpe.thermalcorrenthalpy: 0.165924 hartree
zpe.thermalcorrgfe: 0.121587 hartree
zpe.sumelectzpe: -473.338664 hartree
zpe.sumelectthermal: -473.330097 hartree
zpe.sumelectthermalent: -473.329153 hartree
zpe.sumelectthermalfe: -473.373491 hartree
dipole: 1.0655 4.4355 0.9346
dipole: 4.6564
quadrupole: -91.1138 -76.0781 -69.3637
quadrupole: -10.1556 -2.4638 -1.2693
quadrupole: -12.2619 2.7738 9.4881 -10.1556 -2.4638 -1.2693
hfenergy: -473.4950776 hartree
pointgroup: C01 [X(C8H9Br1O2)]
dipole: -0.86174 -1.5565154 0.4368143 debye
dipolederiv: -0.608352 0.2232388 -0.0202025 0.1811911 -0.2490516 -0.0015586 0.0314673 -0.0314994 -0.1509329 -1.2243667 0.1572432 0.1370441 0.4601213 -0.6427837 -0.1336575 0.1733932 0.0081848 -0.3298426 -1.2522971 -0.0173888 0.1830605 -0.1263525 -0.4700022 0.0294594 0.3228097 0.0152486 -0.3573481 0.0307324 0.0384411 0.0177365 -0.0949284 -0.0528608 0.0136786 0.0004223 0.0079808 0.1202887 -0.1352138 0.1640214 0.0335696 -0.0017293 0.0382445 0.0081962 0.0518154 -0.0331512 0.0475118 -0.1423074 -0.2083446 0.070369 -0.1955505 -0.1784736 -0.0333879 0.0456066 -0.0352482 0.0166091 0.5767058 -0.0177992 -0.0303759 0.2371231 0.2003162 0.0219219 0.0405092 -0.0509146 0.2587999 0.0279953 -0.0257382 -0.0293197 -0.0353808 0.0782042 0.0179179 0.0246902 0.0037254 -0.0355199 0.1104855 -0.0077115 -0.008663 0.1216363 0.0022191 0.0010241 0.0457581 0.0692695 0.0775647 0.7822481 -0.3638163 0.0061621 -0.3522926 0.261894 -0.001384 -0.1659204 0.070757 -0.0000276 1.8515349 -0.0521232 -0.3711522 -0.344822 1.0054616 0.0949582 -0.5116939 -0.0062489 0.2588334 0.0347533 0.0057653 -0.0682324 0.0098627 0.067038 -0.0112043 -0.0621711 -0.0019137 -0.1100987 -0.0150728 -0.0618688 -0.0922591 -0.0332017 0.053826 -0.0416189 -0.088919 -0.041185 -0.0022464 -0.0077878 0.0676652 -0.0436499 0.0732934 -0.0044885 0.0320583 -0.0353667 0.0265666 0.0663244 -0.0053416 0.0289721 0.0216793 0.0120638 0.0166027 -0.0632407 0.0345461 -0.0608545 0.0339702 -0.0662868 -0.0004959 0.0953127 0.048117 0.0920747 -0.0539969 0.0730723 -0.026937 0.0377165 0.0728456 0.0535104 -0.0170378 0.0031042 -0.1535122 0.0562175 -0.0236901 0.0228178 0.0745904 0.0424091 -0.0252182 0.0594175 -0.0474415 0.0641473 0.0948194 0.04455 0.0399815 -0.0724182 -0.0022804 0.0283166 -0.0104329 0.0284878 -0.1423473 -0.0580388 -0.0214274 -0.0190452 0.0705892 -0.0704036 0.0133305 0.066974 0.0566987 0.0134915 0.0278362 0.0205483 0.0424659 -0.004364 unknown
polarizability: 129.855305|-13.5658997|86.9901759|-5.0006961|0.9694292|73.9195043 unknown
InChI: InChI=1S/C8H9BrO2/c9-6-3-1-4-5(2-3)8(10)11-7(4)6/h3-7H,1-2H2
charge 0 multiplicity 1
20 atoms
Br -3.123026 1.280039 -0.306385
O  0.990928 1.450403 0.204356
O  3.029485 0.516296 -0.437516
C  -0.022975 -0.518896 1.241612
C  -1.202415 -0.960966 -0.665437
C  1.095447 -0.941895 0.237024
C  -0.323529 0.901498 0.654196
C  -1.257784 -1.358074 0.837076
C  0.259556 -1.378296 -1.035421
C  -1.22463 0.585404 -0.585525
C  1.868072 0.350127 -0.042276
H  0.275597 -0.514646 2.299296
H  -1.970287 -1.387724 -1.326246
H  1.778542 -1.729307 0.584364
H  -0.751831 1.63777 1.345722
H  -2.18786 -1.038884 1.335788
H  -1.113167 -2.439838 0.999398
H  0.627855 -0.912566 -1.966221
H  0.310244 -2.473301 -1.165145
H  -0.887221 1.11036 -1.491657
