program: Gaussian 09
title: 000263632
version: EM64L-G09RevD.01
frameworkgroup: C1[X(C6H7Cl3O2)]
method: RPBEPBE
basis: SDD
operation: Freq
keyword: #p
keyword: freq=noraman
keyword: PBEPBE/SDD
title: #p freq=noraman PBEPBE/SDD
converged: YES YES NO NO
title: Mulliken charges:
elementType: Cl Cl Cl O O C C C C C C H H H H H H H
charge: 0.144010 0.113352 0.114459 -0.220079 -0.202437 -0.132866 -0.471911 -0.501143 -0.326712 0.505686 -0.733458 0.255928 0.259289 0.242702 0.252425 0.228944 0.230463 0.241350
chargesum: 0.00000
title: Mulliken charges with hydrogens summed into heavy atoms:
elementType: Cl Cl Cl O O C C C C C C
charge: 0.144010 0.113352 0.114459 -0.220079 -0.202437 0.123062 0.030079 -0.019775 0.145101 0.505686 -0.733458
polarizability: 1.09559731e+02 1.70314045e+00 9.58586441e+01 3.97156968e+00 1.53416187e+00 8.63137437e+01
1716.lowfreq: -13.5942 -0.0004 0.0006 0.0027 5.1429 7.7684 15.7558 42.7472 66.2452
frequency: 15.0559 42.7266 66.1152 73.7909 133.3499 164.8648 216.2216 232.7565 248.3369 273.9207 297.1727 338.7143 362.0859 393.7942 485.6479 610.0969 693.2198 748.3524 756.4560 767.1553 795.6456 821.1022 839.3748 893.8744 922.0190 943.2354 1008.7463 1045.6949 1076.9218 1102.3988 1160.2930 1166.6651 1178.6635 1215.7673 1258.0588 1335.6443 1393.9845 1444.5965 1453.4989 1472.0660 1642.2246 3030.6019 3099.0644 3107.9190 3110.6675 3137.9544 3198.8997 3219.0794
redmass: 5.0956 7.9487 3.1247 6.3040 8.0998 7.8491 15.5877 4.4113 9.1884 11.8930 6.6093 6.6671 2.5701 21.8197 4.2323 13.0759 6.0963 6.4787 12.1881 1.4317 1.6143 2.5233 3.0508 2.0820 2.7649 2.9495 2.5661 1.2151 1.2407 1.1803 4.8262 1.4563 2.0681 1.6340 1.2525 1.2682 1.6505 1.0889 1.1311 1.2969 10.9548 1.0590 1.0526 1.0834 1.0820 1.0939 1.1171 1.1151
irintensity: 0.3967 0.5717 0.3004 0.9669 0.8309 0.2257 0.2068 1.5159 3.3213 0.6389 11.0959 3.6966 0.4355 2.1303 16.1115 130.0590 40.1831 106.9295 58.0729 13.3680 2.2822 7.9097 30.5125 28.6581 27.6883 168.7748 9.0035 30.6118 17.1226 2.5009 251.7164 4.5212 43.9610 2.2337 7.6837 2.6938 7.1676 13.4007 12.3734 6.8841 131.2904 23.1136 17.8026 0.6939 11.3914 9.4116 3.1479 16.4861
temp: 298.150 k
press: 1.00000 atm
elementType: 17 17 17 8 8 6 6 6 6 6 6 1 1 1 1 1 1 1
symmnumber: 1
zpe: 316977.5 jmol-1
zpe.correction: 0.120730 hartree
zpe.thermalcorrener: 0.133045 hartree
zpe.thermalcorrenthalpy: 0.133989 hartree
zpe.thermalcorrgfe: 0.079063 hartree
zpe.sumelectzpe: -1762.554354 hartree
zpe.sumelectthermal: -1762.542039 hartree
zpe.sumelectthermalent: -1762.541095 hartree
zpe.sumelectthermalfe: -1762.596021 hartree
dipole: 3.2463 1.2310 0.3169
dipole: 3.4863
quadrupole: -77.4383 -86.2854 -84.3860
quadrupole: 2.8075 0.9479 -3.4654
quadrupole: 5.2649 -3.5821 -1.6828 2.8075 0.9479 -3.4654
hfenergy: -1762.6750841 hartree
pointgroup: C01 [X(C6H7Cl3O2)]
dipole: 1.2931311 0.1102205 0.4438265 debye
dipolederiv: -0.3210568 0.0053436 -0.3002942 -0.0155432 -0.1170875 -0.0331986 -0.2885768 -0.0165836 -0.5333765 -0.1990242 0.0608352 -0.0242552 0.0881699 -0.6682883 0.2196283 -0.0278109 0.2371545 -0.2221487 -0.2905993 0.1784603 0.1794774 0.139444 -0.4053851 -0.2609195 0.188022 -0.2909957 -0.4073475 -1.5430394 -0.1029658 -0.2656976 -0.2506527 -0.2913659 -0.0756638 -0.5774285 -0.0385821 -0.6429533 -0.6254519 -0.1295918 0.1704582 -0.0526017 -0.3084948 0.1864854 -0.1986804 0.0978308 -0.7650805 -0.2371896 0.0496012 0.133399 0.0540911 0.0183646 -0.1038803 0.2768331 -0.0477966 -0.053373 0.0722192 -0.045698 -0.0626773 0.0126612 0.0041041 -0.1137461 -0.0749467 -0.087603 -0.1227122 -0.1614032 -0.1041746 0.022906 -0.0841193 0.053775 -0.0246701 -0.1320403 -0.0172506 0.0695892 1.1585654 -0.0152918 0.0279461 0.0528235 0.3280239 0.1706055 -0.0236888 0.0274046 0.2264191 1.3934583 0.3396223 0.0484489 0.3177503 0.1902471 -0.1786454 0.6217661 -0.1369368 1.0291466 0.5962294 -0.3356436 0.2125117 -0.3467297 1.2417113 0.1056555 0.261974 0.1260054 1.2227997 0.0815274 0.026612 0.0421672 0.0684954 -0.005177 0.0680788 0.0465723 0.0662476 -0.0453236 0.0977252 0.0177939 -0.1009621 0.0204077 0.0394935 0.0410307 -0.0865597 0.0109858 0.024374 0.0905055 0.0215325 -0.0172234 0.0329025 -0.0966909 -0.0522886 -0.0033558 -0.0321138 0.0687137 -0.1074108 0.0384948 -0.0424279 0.0751855 0.0454792 0.0438939 -0.0222168 0.0310169 0.0999089 0.0573328 -0.009157 -0.0094917 -0.0684329 -0.0840886 0.0631383 0.0063888 0.0600631 0.0923725 -0.0198274 -0.0020307 -0.02184 -0.0240914 0.015273 0.0310459 0.0364609 0.1292645 0.0108971 -0.0425608 0.0062574 0.0075551 -0.0197601 0.0401064 -0.08655 -0.0027127 -0.1181112 -0.0519056 unknown
polarizability: 109.9329219|-2.2311624|86.5011265|2.4710168|2.5248382|95.2980701 unknown
InChI: InChI=1S/C6H7Cl3O2/c7-6(8,9)5(10)11-3-4-1-2-4/h4H,1-3H2
charge 0 multiplicity 1
18 atoms
Cl -3.056823 -0.295847 -1.406293
Cl -1.828045 -1.896735 0.841451
Cl -2.816572 0.938293 1.340589
O  0.171098 0.420118 0.879293
O  -0.253588 0.708014 -1.401335
C  2.535157 -0.241299 0.485027
C  2.754694 -0.790073 -0.934655
C  3.854691 0.03945 -0.263073
C  1.594104 0.912528 0.720091
C  -0.595502 0.361259 -0.255136
C  -2.005109 -0.194428 0.10129
H  2.582086 -0.96215 1.307776
H  2.186866 -0.329401 -1.747462
H  2.91065 -1.867121 -1.040016
H  4.755381 -0.468255 0.091644
H  4.028481 1.054012 -0.635693
H  1.617225 1.640515 -0.110313
H  1.780107 1.414721 1.682717
