program: Gaussian 09
title: 000263630
version: EM64L-G09RevD.01
frameworkgroup: C1[X(C13H15NS)]
method: RPBEPBE
basis: SDD
operation: Freq
keyword: #p
keyword: freq=noraman
keyword: PBEPBE/SDD
title: #p freq=noraman PBEPBE/SDD
converged: NO YES NO NO
title: Mulliken charges:
elementType: S N C C C C C C C C C C C C C H H H H H H H H H H H H H H H
charge: 0.162009 -0.028691 -0.560235 -0.138005 -0.335805 -0.423747 -0.381944 -0.392079 -0.325812 0.457230 -0.380089 -0.363907 -0.224357 -0.232579 -0.232468 0.272703 0.250563 0.229879 0.215250 0.191559 0.221719 0.205264 0.190574 0.204673 0.211235 0.273819 0.243967 0.229550 0.229042 0.230684
chargesum: 0.00000
title: Mulliken charges with hydrogens summed into heavy atoms:
elementType: S N C C C C C C C C C C C C C
charge: 0.162009 -0.028691 -0.287532 0.112558 0.109324 -0.010469 0.013893 0.023829 -0.325812 0.457230 -0.106270 -0.119940 0.005193 -0.003537 -0.001784
polarizability: 2.30986395e+02 1.01884092e-01 1.55978525e+02 -1.38283700e+01 4.99839205e+00 9.82755127e+01
1716.lowfreq: -16.2288 -7.8811 -0.0013 -0.0012 0.0018 4.7860 35.4981 54.5477 100.6963
frequency: 35.3487 54.5032 100.6825 128.7920 150.0747 214.4154 262.0405 266.8727 322.1335 328.8226 362.9360 396.1343 401.6553 445.1387 461.6529 509.0424 604.2064 606.9882 626.4186 636.7303 690.5226 697.4713 704.5694 780.4171 784.2661 809.1176 851.9285 857.3896 872.3367 898.5773 907.5624 940.3788 944.5749 987.2942 988.9134 990.9579 1003.5315 1026.3539 1050.4823 1061.8871 1082.6860 1084.8090 1107.6586 1140.2140 1161.6189 1172.6888 1187.5277 1199.3596 1234.9463 1246.6703 1259.1323 1293.6842 1299.7116 1305.3457 1317.2286 1333.2588 1338.0387 1347.5155 1357.6573 1383.6793 1435.9144 1452.2691 1461.3006 1468.4367 1473.3240 1477.1254 1577.9389 1594.9400 1611.3681 2940.4115 2968.5931 2981.7979 2985.3421 2995.5050 3036.2023 3041.7746 3049.1711 3054.3509 3069.2101 3126.6358 3134.1121 3146.1735 3159.8608 3170.0627
redmass: 3.8505 4.3395 3.2944 4.8005 3.5886 3.2421 5.1498 3.4082 5.1756 2.2354 3.7764 3.7142 2.8283 3.9991 2.4109 3.6939 5.6749 5.7950 6.8387 5.4513 2.7054 1.8776 3.1028 1.8476 3.6392 1.7873 2.5784 1.2506 2.5172 3.1235 1.9921 1.4381 2.7924 1.4259 4.3918 2.6387 1.3293 2.1014 1.5956 1.7707 1.5931 1.5542 1.2548 2.1586 1.4457 1.0591 1.1130 1.5228 1.7641 1.9332 1.5220 1.4292 1.2159 1.4623 1.3232 1.3449 1.3624 1.4762 1.4315 8.4729 2.2801 1.0843 1.0895 1.0828 1.1119 2.2214 7.2324 8.3452 6.1096 1.0818 1.0636 1.0610 1.0656 1.0614 1.0959 1.0994 1.0950 1.1008 1.0954 1.0850 1.0885 1.0931 1.0964 1.1003
irintensity: 0.0238 1.1510 0.4076 1.4163 0.7298 0.3431 1.6619 1.0884 8.9145 0.9364 0.6164 2.1037 0.0258 0.8515 0.9722 2.7011 14.2021 13.0350 6.7517 33.1853 13.6691 40.2856 5.1557 54.9216 0.8211 4.3071 6.4545 0.0584 9.5970 49.6167 45.9045 4.6640 3.4572 0.2937 4.0625 11.0440 0.5483 6.7130 0.6106 1.6728 10.0942 5.0045 1.2504 9.8707 1.1044 0.3854 9.6741 7.1054 16.8818 26.5202 16.3168 14.9969 3.3399 15.3877 5.0251 2.2456 4.1527 5.1593 4.9421 1.2865 16.9309 9.9933 10.4236 15.1003 13.8920 15.7341 49.0416 33.6863 4.1187 23.0404 45.1906 27.2477 49.2720 12.5609 58.5517 61.7804 2.2098 26.2011 60.2190 1.2021 6.1030 21.7259 19.5172 21.4595
temp: 298.150 k
press: 1.00000 atm
elementType: 16 7 6 6 6 6 6 6 6 6 6 6 6 6 6 1 1 1 1 1 1 1 1 1 1 1 1 1 1 1
symmnumber: 1
zpe: 652134.5 jmol-1
zpe.correction: 0.248385 hartree
zpe.thermalcorrener: 0.261087 hartree
zpe.thermalcorrenthalpy: 0.262031 hartree
zpe.thermalcorrgfe: 0.208571 hartree
zpe.sumelectzpe: -956.106085 hartree
zpe.sumelectthermal: -956.093383 hartree
zpe.sumelectthermalent: -956.092439 hartree
zpe.sumelectthermalfe: -956.145899 hartree
dipole: 0.8311 -0.2533 0.4134
dipole: 0.9622
quadrupole: -79.4309 -95.5925 -98.8016
quadrupole: 1.1412 -3.3501 1.4368
quadrupole: 11.8441 -4.3175 -7.5266 1.1412 -3.3501 1.4368
hfenergy: -956.3544695 hartree
pointgroup: C01 [X(C13H15N1S1)]
dipole: -0.3271741 -0.1166679 -0.1504842 debye
polarizability: 231.1844852|-3.0487408|153.5293265|-12.5051061|-12.6503095|100.5266204 unknown
InChI: InChI=1S/C13H15NS/c1-2-6-10(7-3-1)13-14-11-8-4-5-9-12(11)15-13/h1-3,6-7,11-12H,4-5,8-9H2
charge 0 multiplicity 1
30 atoms
S  -0.462781 2.007574 0.312747
N  -0.623834 -0.675968 0.745886
C  -2.191172 1.185986 0.287386
C  -1.968993 -0.128723 1.095907
C  -2.641135 0.946556 -1.16933
C  -3.099264 -1.164114 0.902563
C  -3.843147 -0.027903 -1.242799
C  -3.481158 -1.375588 -0.578456
C  0.229913 0.252001 0.417054
C  1.664624 0.022053 0.148655
C  2.216233 -1.268901 0.384766
C  2.507938 1.057609 -0.333451
C  3.58191 -1.513025 0.141635
C  3.876938 0.810071 -0.571868
C  4.418559 -0.474454 -0.336186
H  -2.880019 1.86222 0.822224
H  -1.913558 0.135028 2.175746
H  -1.798374 0.515333 -1.742728
H  -2.891685 1.914396 -1.641804
H  -3.990182 -0.813675 1.461826
H  -2.774928 -2.113834 1.366163
H  -4.128527 -0.177767 -2.301439
H  -4.723831 0.414823 -0.732335
H  -4.328223 -2.084374 -0.647993
H  -2.627565 -1.834322 -1.116426
H  1.554464 -2.056879 0.757617
H  2.089188 2.051262 -0.530303
H  3.998137 -2.509683 0.325772
H  4.518775 1.6162 -0.943666
H  5.4813 -0.665701 -0.52256
