program: Gaussian 09
title: 000263623
version: EM64L-G09RevD.01
frameworkgroup: C1[X(C4H11NO4S2)]
method: RPBEPBE
basis: SDD
operation: Freq
keyword: #p
keyword: freq=noraman
keyword: PBEPBE/SDD
title: #p freq=noraman PBEPBE/SDD
converged: YES YES NO NO
title: Mulliken charges:
elementType: S S O O O O N C C C C H H H H H H H H H H H
charge: 0.995286 1.029128 -0.523054 -0.550804 -0.521996 -0.546243 -0.449427 -0.369979 -0.716517 -0.744946 -0.637815 0.276918 0.284990 0.279587 0.326708 0.284948 0.264943 0.293757 0.329761 0.205341 0.254261 0.235154
chargesum: 0.00000
title: Mulliken charges with hydrogens summed into heavy atoms:
elementType: S S O O O O N C C C C
charge: 0.995286 1.029128 -0.523054 -0.550804 -0.521996 -0.546243 -0.449427 0.191928 0.174725 0.143515 0.056941
polarizability: 1.41615628e+02 -1.41158790e+00 1.21938593e+02 -5.25034816e+00 -5.10781920e+00 1.01010306e+02
1716.lowfreq: -12.4768 0.0011 0.0024 0.0037 6.4510 15.5461 42.1984 62.1310 71.9366
frequency: 42.0072 62.0635 71.9167 126.5049 132.8401 141.2718 154.3953 171.1788 181.9620 185.4258 193.4428 220.2902 239.1646 250.1249 258.2694 312.2976 326.2622 350.3009 354.0790 392.3907 471.9034 500.5048 548.5901 591.2304 766.2815 804.2579 810.5336 857.7505 898.2453 909.2421 985.8651 996.1014 1024.8292 1032.4399 1047.5673 1073.6884 1103.9692 1270.1223 1298.9846 1311.6189 1317.8987 1396.4187 1407.2555 1408.6316 1416.2802 1421.5566 1426.1589 1466.5226 1478.5526 2993.8131 2996.8927 3007.2201 3015.5245 3051.7401 3089.2962 3101.9036 3159.0478 3164.4932 3185.6793 3190.6480
redmass: 2.1745 5.4370 3.8853 2.4659 7.5520 2.5591 2.3745 4.5317 1.0957 2.9069 2.1550 3.2753 4.0864 2.1235 2.9967 7.1497 7.5728 8.2174 6.7638 8.3792 4.4174 3.7283 9.4505 7.8073 1.2619 13.0458 13.6212 3.6162 4.1315 3.0717 1.3106 1.3008 1.6743 2.6366 1.6913 2.0401 1.6487 1.1131 1.1296 1.2300 1.1317 1.1809 1.0552 1.0545 1.0811 1.0566 1.0527 1.0470 1.0410 1.0361 1.0592 1.0254 1.0256 1.1018 1.0986 1.1018 1.1080 1.1077 1.1074 1.1079
irintensity: 0.8863 8.8049 3.7830 5.6740 0.3873 2.4685 6.7214 5.5834 0.0747 0.6278 1.4723 0.8020 1.1707 1.5376 0.7589 13.2709 42.0450 14.0367 69.6698 12.5479 105.1076 12.5486 36.9423 37.3636 2.1713 88.7999 34.3861 4.2324 47.0406 32.9595 52.6327 33.9985 55.0906 20.5352 38.9062 5.3623 0.5373 0.0250 5.5153 10.4841 9.0336 18.5844 8.5464 13.2886 23.2946 14.3154 18.6139 6.4656 20.0286 12.4531 6.4910 8.6335 5.7887 4.3397 24.9387 10.7271 7.8387 5.4372 0.3460 0.5612
temp: 298.150 k
press: 1.00000 atm
elementType: 16 16 8 8 8 8 7 6 6 6 6 1 1 1 1 1 1 1 1 1 1 1
symmnumber: 1
zpe: 413701.2 jmol-1
zpe.correction: 0.157570 hartree
zpe.thermalcorrener: 0.173240 hartree
zpe.thermalcorrenthalpy: 0.174184 hartree
zpe.thermalcorrgfe: 0.115085 hartree
zpe.sumelectzpe: -1309.531586 hartree
zpe.sumelectthermal: -1309.515917 hartree
zpe.sumelectthermalent: -1309.514972 hartree
zpe.sumelectthermalfe: -1309.574072 hartree
dipole: 0.1041 0.7010 1.0002
dipole: 1.2258
quadrupole: -93.6053 -78.0047 -83.6884
quadrupole: -8.9514 -14.1006 0.4061
quadrupole: -8.5058 7.0948 1.4110 -8.9514 -14.1006 0.4061
hfenergy: -1309.6891562 hartree
pointgroup: C01 [X(C4H11N1O4S2)]
dipole: -0.0300642 0.2729782 -0.3964493 debye
dipolederiv: 1.5396102 0.148908 -0.0026149 0.5357552 1.1574679 0.0423279 0.3920306 -0.0745675 1.1532965 1.7732237 -0.0326287 0.1843859 -0.3932075 1.1484638 -0.1453085 -0.1630197 -0.1875069 0.9703822 -0.816605 0.0058573 -0.0454276 0.0009396 -0.5422401 0.0272838 0.0002268 0.0208196 -0.4412031 -0.553016 -0.0339762 0.0984058 -0.1365374 -0.5692805 -0.0726019 -0.1026011 -0.0885901 -0.7316674 -0.7542667 -0.0492472 -0.1027176 -0.1152406 -0.5008479 -0.0480512 -0.0411221 0.0070486 -0.4970788 -0.5554095 -0.0239648 -0.0013374 0.1429587 -0.6940201 0.0894171 0.0469294 0.0334963 -0.4757258 -0.7349126 -0.0852281 -0.1258481 -0.0794868 -0.3953888 0.1850323 -0.1368885 0.3257215 -0.3633029 -0.3248216 -0.0047835 -0.0433972 -0.0441852 0.2634324 -0.072305 -0.0160776 -0.2981873 0.1074756 -0.1638222 0.0234536 0.002067 0.0353721 -0.0743095 0.0102052 -0.0408694 0.0234084 -0.0782151 -0.2596863 0.0248275 0.0268086 0.0334318 -0.0915313 -0.0064896 -0.0359361 -0.0085353 -0.1434652 0.1377452 -0.0030905 0.000728 0.0121551 -0.0760514 0.0775537 -0.0037975 0.1278691 -0.0856221 0.0267374 0.011406 0.0832619 0.0798286 0.0036111 0.0062458 0.0272206 0.0632378 0.0732747 0.0836056 -0.0133484 -0.0868802 -0.0510881 0.0137498 -0.0126299 -0.0525186 0.0534366 0.0586185 0.0686595 -0.0558063 -0.0400356 -0.075684 0.0455005 -0.0085195 -0.0280333 -0.0003445 0.0546888 0.1092827 0.0577234 0.0066064 0.0173693 0.1006039 0.0163433 0.0118079 0.0253022 0.1009834 0.1101871 0.0097702 0.0346957 0.0060925 0.0272959 -0.0055182 0.035102 -0.0107798 0.020314 0.1216894 -0.0251769 0.0084695 -0.0245641 -0.0240965 0.0113738 0.0155239 0.0191234 0.0294816 0.0358157 0.0505827 0.0271634 0.0455179 0.0700558 0.0171351 0.0745824 -0.0035061 0.0616108 0.1538977 -0.0211614 -0.0564405 -0.0047238 0.1078057 0.0035351 -0.0145033 0.0137139 0.0700495 -0.0995749 0.0117303 0.0961771 0.0621344 0.1007147 -0.0245037 0.0516716 0.0201971 0.0096 -0.0022722 -0.031553 -0.0722896 -0.0792606 0.0867243 -0.0586762 -0.0298632 -0.0113648 0.0161048 0.1039328 0.035706 0.0082195 0.032423 -0.1576596 -0.0318494 0.0101354 -0.049992 0.0903998 unknown
polarizability: 141.7796176|3.2381882|122.4636791|-1.2565125|5.0544204|100.3212305 unknown
InChI: InChI=1S/C4H11NO4S2/c1-4-5(10(2,6)7)11(3,8)9/h4H2,1-3H3
charge 0 multiplicity 1
22 atoms
S  -1.373266 -0.263957 -0.073415
S  1.804904 -0.0545 0.575739
O  -2.716684 0.625973 0.147729
O  -0.838087 -0.55309 -1.591253
O  2.789214 0.917792 1.427076
O  1.711067 -1.650702 0.861914
N  -0.005233 0.571176 1.043742
C  -0.14204 2.05857 1.116921
C  -1.501686 -1.9123 0.863871
C  2.194716 0.159982 -1.295726
C  -0.085096 2.875631 -0.189281
H  -1.110619 2.219848 1.627355
H  0.655382 2.367387 1.82083
H  -2.184839 -2.534458 0.268706
H  -0.470691 -2.29528 0.910908
H  -1.900478 -1.65714 1.854172
H  2.402697 1.227535 -1.443927
H  3.078929 -0.472286 -1.460389
H  1.292404 -0.190408 -1.820261
H  0.891612 2.777525 -0.694874
H  -0.884783 2.575564 -0.888215
H  -0.228119 3.945137 0.047278
