program: Gaussian 09
title: 000263617
version: EM64L-G09RevD.01
frameworkgroup: C1[X(C7H15N)]
method: RPBEPBE
basis: SDD
operation: Freq
keyword: #pfreq=noraman
keyword: PBEPBE/SDD
title: #p freq=noraman PBEPBE/SDD
converged: YES YES NO NO
title: Mulliken charges:
elementType: N C C C C C C C H H H H H H H H H H H H H H H
charge: -0.165643 -0.080952 -0.080575 -0.003833 -0.723099 -0.723218 -0.699745 -0.699677 0.211845 0.211837 0.166637 0.217541 0.206336 0.224154 0.206332 0.217637 0.224052 0.201695 0.225933 0.217574 0.217574 0.201716 0.225877
chargesum: 0.00000
title: Mulliken charges with hydrogens summed into heavy atoms:
elementType: N C C C C C C C
charge: -0.165643 0.130894 0.131262 0.162805 -0.075068 -0.075196 -0.054543 -0.054509
polarizability: 9.43229091e+01 -1.44296048e-03 8.74228437e+01 4.59516071e-01 4.51256525e-04 6.80013087e+01
1716.lowfreq: -0.0001 0.0002 0.0007 5.8131 9.3564 14.8100 74.9597 130.3828 146.5407
frequency: 74.9553 130.3492 146.5371 150.5320 175.3998 205.6516 234.4492 261.5319 296.0528 306.4081 438.7530 438.8410 460.1100 512.3494 676.9465 771.0459 778.8626 876.6586 917.5094 947.5022 948.4369 1004.3226 1004.7333 1029.9097 1085.5000 1104.5528 1107.6401 1142.6304 1166.4539 1172.7530 1180.8145 1255.7493 1317.8023 1326.1354 1358.4661 1372.6065 1388.9271 1390.3462 1395.1431 1418.3282 1456.3567 1458.6531 1465.7582 1468.7549 1470.4590 1473.7696 1484.6131 1486.8186 2845.8135 2978.4229 2978.9784 2980.8530 2982.4162 3022.6880 3038.4062 3063.3720 3065.3919 3074.4541 3078.9241 3082.8445 3088.8275 3093.9218 3101.2899
redmass: 2.6550 1.8287 1.2454 1.1309 2.1143 1.0273 1.7076 1.3615 2.5784 2.4920 2.9635 2.6483 2.3868 2.7125 3.1783 3.1658 2.1818 2.5238 1.1822 1.4115 1.1661 1.3027 2.1071 1.8792 1.8160 1.7852 1.6717 1.8112 2.0321 2.2559 1.9685 1.4207 1.4487 1.3875 1.2718 1.2490 1.2277 1.3543 1.2118 2.2202 1.0444 1.0474 1.0477 1.0468 1.0529 1.1153 1.0561 1.0509 1.0819 1.0366 1.0350 1.0368 1.0358 1.0835 1.0887 1.0989 1.0988 1.0999 1.0990 1.1003 1.0994 1.0987 1.0975
irintensity: 0.1667 0.0538 0.1296 0.2006 1.8288 0.0047 0.2006 0.3010 0.6543 0.1730 5.8747 3.6429 2.3579 3.2158 4.4478 0.4822 10.2156 2.3967 2.2829 0.0060 2.3568 8.2621 6.3078 4.5759 24.3691 0.1873 4.6144 0.4705 2.7451 50.7993 10.7650 1.0805 4.4266 55.1784 0.3964 25.9898 19.5358 5.6657 18.2750 13.6130 2.3485 17.7504 0.0076 0.6418 13.6011 13.9823 12.2347 18.2612 79.2447 13.4289 59.1433 52.1678 4.4941 11.4951 47.0047 10.6415 56.9603 21.2682 60.7981 2.2437 62.4501 28.4462 46.5371
temp: 298.150 k
press: 1.00000 atm
elementType: 7 6 6 6 6 6 6 6 1 1 1 1 1 1 1 1 1 1 1 1 1 1 1
symmnumber: 1
zpe: 539596.5 jmol-1
zpe.correction: 0.205521 hartree
zpe.thermalcorrener: 0.215970 hartree
zpe.thermalcorrenthalpy: 0.216915 hartree
zpe.thermalcorrgfe: 0.170711 hartree
zpe.sumelectzpe: -329.779202 hartree
zpe.sumelectthermal: -329.768753 hartree
zpe.sumelectthermalent: -329.767809 hartree
zpe.sumelectthermalfe: -329.814013 hartree
dipole: 0.0921 0.0004 1.3454
dipole: 1.3485
quadrupole: -49.9258 -50.6725 -52.4307
quadrupole: -0.0010 -0.5323 -0.0005
quadrupole: 1.0838 0.3372 -1.4210 -0.0010 -0.5323 -0.0005
hfenergy: -329.9847237 hartree
pointgroup: C01 [X(C7H15N1)]
dipole: -0.0481312 -0.0167379 -0.5280929 debye
dipolederiv: -0.9465359 0.0043497 -0.0478121 0.0013983 -0.2199102 -0.0055913 -0.1437706 -0.0047626 -0.3987072 0.2634359 -0.0706301 -0.0351784 -0.1013111 0.1084756 0.0500282 0.0001668 0.0735329 0.2247059 0.2667987 0.065424 -0.0404557 0.0987377 0.0977771 -0.0408676 -0.0075574 -0.065362 0.2324564 0.6771951 -0.0048976 -0.0234224 -0.0075092 0.1893193 0.0047871 -0.0979825 0.0054392 0.3278611 0.0081655 0.0272938 0.0708624 0.0844018 -0.0196918 -0.0257358 0.0480205 -0.0237789 0.0081031 0.0061745 -0.0226356 0.0730288 -0.0816007 -0.0144414 0.025837 0.0539637 0.0245286 0.0052023 -0.0380623 0.0493026 -0.0472258 0.0726151 -0.0847514 0.0313942 0.0080483 0.0307733 0.0622357 -0.0404825 -0.0532254 -0.0442263 -0.0728932 -0.0859886 -0.0205291 0.0125027 -0.0209504 0.0659889 -0.0064072 0.0022119 0.1247708 0.025145 -0.0122317 0.0600902 0.0461525 0.0910549 -0.1340957 -0.0069763 0.0057935 0.1236948 -0.0223521 -0.0222133 -0.0694753 0.0461454 -0.0991207 -0.123609 -0.0779922 -0.0016186 -0.0679189 0.0033369 -0.0026019 -0.008689 0.0810708 -0.0099651 -0.2819245 0.0399905 -0.1040139 -0.0232623 -0.04836 -0.1431526 -0.0546222 0.00886 -0.066613 0.0852288 -0.1280846 0.091893 -0.0977879 0.0588413 0.0664304 0.0044092 -0.1166232 0.0198624 0.0162018 0.0715055 -0.0044543 0.0405283 -0.0432172 0.0647243 0.1128472 0.0797546 0.0621981 -0.0710891 -0.1296336 -0.0952997 -0.0919535 -0.0639956 0.0668578 -0.0066803 -0.1132598 -0.0221151 0.0171978 0.0422913 0.0991329 -0.0295357 0.045897 -0.1358278 0.0702079 0.0066776 0.0821056 0.0756917 0.0717 0.0073067 0.0388639 0.0488952 0.0513931 -0.121635 0.0761508 -0.0716769 -0.058196 -0.1837982 0.0484188 0.0760424 0.0209252 0.0801688 0.0200801 0.0993229 -0.0028182 0.0542263 0.1053547 0.0061835 0.0069883 -0.0022279 0.079856 -0.0356381 -0.0478476 0.0262018 -0.1402909 0.0405115 -0.1292762 -0.0424146 -0.089408 -0.1136153 -0.0411277 -0.0434799 -0.0563324 0.0623573 0.0441915 0.1235939 -0.0498267 0.0837281 -0.1100961 0.0531107 -0.0480608 0.068285 0.0552484 -0.1843874 -0.0385787 0.0788032 -0.0095817 0.0798624 -0.0231892 0.1006641 -0.0006121 0.05521 0.1050456 -0.0062743 0.0074373 -0.001465 0.0796573 0.0209889 -0.0489188 -0.0398743 -0.140003 unknown
polarizability: 94.329763|-0.0627428|87.4025108|-0.1310604|-0.6357802|68.0147878 unknown
InChI: InChI=1S/C7H15N/c1-5(2)8-6(3)7(8)4/h5-7H,1-4H3
charge 0 multiplicity 1
23 atoms
N  0.056127 0.043933 0.26062
C  -1.001526 0.793043 -0.522659
C  -1.014748 -0.73628 -0.472772
C  1.428381 0.012039 -0.340185
C  -1.958339 1.685073 0.246368
C  -1.987053 -1.559374 0.351827
C  2.148652 -1.257273 0.153485
C  2.172051 1.29801 0.068448
H  -0.667572 1.210891 -1.48841
H  -0.688016 -1.221564 -1.409052
H  1.367889 -0.024627 -1.458793
H  -1.482185 2.656776 0.474789
H  -2.875418 1.881709 -0.340637
H  -2.249164 1.224836 1.205217
H  -2.904921 -1.783045 -0.224233
H  -1.526051 -2.519781 0.648783
H  -2.274633 -1.029719 1.275187
H  3.173089 -1.313585 -0.258017
H  2.211644 -1.248839 1.25638
H  1.601813 -2.168458 -0.151133
H  1.640597 2.196638 -0.295005
H  3.196327 1.308674 -0.347146
H  2.237657 1.361124 1.16944
