program: Gaussian 09
title: 000263599
version: EM64L-G09RevD.01
frameworkgroup: C1[X(C9H10BrNO)]
method: RPBEPBE
basis: SDD
operation: Freq
keyword: #p
keyword: freq=noraman
keyword: PBEPBE/SDD
title: #p freq=noraman PBEPBE/SDD
converged: NO YES NO NO
title: Mulliken charges:
elementType: Br O N C C C C C C C C C H H H H H H H H H H
charge: -0.034067 -0.255586 -0.448527 -0.507286 0.481107 0.212634 -0.442875 -0.347096 -0.643843 -0.197058 -0.212318 -0.252664 0.261222 0.261673 0.312238 0.298385 0.298738 0.219429 0.307615 0.228362 0.228850 0.231067
chargesum: 0.00000
title: Mulliken charges with hydrogens summed into heavy atoms:
elementType: Br O N C C C C C C C C C
charge: -0.034067 -0.255586 -0.136289 0.015609 0.481107 0.212634 -0.223446 -0.039482 -0.046719 0.031304 0.016531 -0.021597
polarizability: 2.00708627e+02 3.76754066e+00 1.14545054e+02 -1.47755828e-01 -2.71222619e-02 5.41612823e+01
1716.lowfreq: -47.0870 -15.8722 -5.2377 -4.0795 -0.0006 -0.0006 -0.0004 32.1548 66.1666
frequency: -46.7590 31.9347 66.1485 66.8655 99.9454 152.2124 217.4267 248.6394 325.4833 342.2361 406.7602 501.5623 524.7381 569.4602 611.9978 615.5021 647.6200 696.7545 726.1353 767.7268 771.0831 820.9479 842.5035 918.9449 925.0447 959.2051 974.0518 985.2947 1001.5523 1026.0652 1075.6164 1089.9710 1114.3967 1165.3105 1173.3186 1188.6794 1222.6079 1258.6338 1272.7539 1308.6226 1325.6614 1386.1086 1428.4821 1448.9842 1451.8456 1484.9017 1514.4046 1601.3987 1614.3829 1622.1060 2991.0315 3046.9654 3086.8947 3110.0489 3134.8953 3147.1916 3167.9876 3174.1468 3197.6138 3515.2044
redmass: 2.0348 6.0213 6.7477 5.2836 3.7675 10.1001 6.5500 3.7992 6.0579 5.5559 2.9105 2.7807 7.6060 2.6988 6.3697 6.3597 1.1772 1.9872 4.8477 1.4210 1.4806 5.3845 1.2691 1.4291 6.4653 1.4728 1.3537 6.1646 1.3086 2.2155 3.8141 1.5610 1.2026 2.0243 1.0526 1.1127 1.3654 2.0041 1.1488 1.5421 1.5285 6.7974 2.3473 1.1043 1.0969 2.3413 2.1464 6.5684 5.2084 4.8724 1.0595 1.1013 1.0570 1.0889 1.0868 1.0933 1.0999 1.1114 1.0951 1.0762
irintensity: 0.7771 0.3562 0.9765 5.1785 6.3918 2.4155 12.8262 0.9399 1.0019 3.6362 0.0157 23.0634 49.7248 2.9322 12.9933 7.4668 39.4818 52.8838 8.6322 15.4309 98.0108 3.9326 0.1451 13.7812 20.0100 0.0354 0.2149 0.0225 3.0161 5.1256 1.1969 16.0403 1.0852 60.6184 0.7903 2.7119 7.9968 30.4284 0.6597 20.4167 81.9981 69.6864 108.8466 15.5393 5.4921 59.7199 358.6200 81.0387 66.9080 78.5399 13.5226 7.4417 5.3681 15.3477 0.4894 28.6564 23.4441 3.9106 7.0343 13.5925
temp: 298.150 k
press: 1.00000 atm
elementType: 35 8 7 6 6 6 6 6 6 6 6 6 1 1 1 1 1 1 1 1 1 1
symmnumber: 1
zpe: 449580.6 jmol-1
zpe.correction: 0.171236 hartree
zpe.thermalcorrener: 0.182113 hartree
zpe.thermalcorrenthalpy: 0.183058 hartree
zpe.thermalcorrgfe: 0.131814 hartree
zpe.sumelectzpe: -491.531089 hartree
zpe.sumelectthermal: -491.520212 hartree
zpe.sumelectthermalent: -491.519267 hartree
zpe.sumelectthermalfe: -491.570511 hartree
dipole: 2.4265 -2.8801 0.0025
dipole: 3.7660
quadrupole: -82.8734 -76.0629 -83.5379
quadrupole: -2.7187 -0.0230 -0.0163
quadrupole: -2.0487 4.7618 -2.7132 -2.7187 -0.0230 -0.0163
hfenergy: -491.7023251 hartree
pointgroup: C01 [X(C9H10Br1N1O1)]
dipole: -1.0126378 1.0816128 0.0013854 debye
dipolederiv: -0.5942002 -0.0517503 0.0005622 -0.1735545 -0.1880219 0.0000559 0.0002403 -0.0002151 -0.1447782 -0.7947311 -0.0626952 0.0000684 0.6387261 -0.8688093 0.0010943 0.0018768 -0.0016045 -0.3271955 -1.9137227 0.2035372 -0.000575 0.3883602 -0.3644519 0.0002342 -0.0012599 0.0000565 -0.3158793 -0.3801321 -0.059991 0.0004748 -0.4633393 -0.1459651 -0.0009389 -0.0008557 -0.0015573 0.1272318 1.1975075 0.0679556 0.0012414 0.3510455 0.0454365 0.0003136 0.0014572 0.0000885 0.1006081 1.7935788 -0.146041 0.0010229 -0.9266943 1.1092991 -0.001136 -0.0005694 0.0015308 0.1761001 -0.303881 -0.0051859 0.0000356 0.1207148 0.0485809 0.0003095 -0.0002913 0.0000123 -0.2135107 -0.2594279 -0.0255006 -0.0000116 -0.2070675 -0.0849354 -0.000284 -0.0001165 0.0000151 -0.1665423 0.8728662 0.2175223 -0.000388 0.3238289 0.2025561 -0.0000266 0.0006529 0.0004694 0.1061916 0.0906883 -0.0160187 0.000316 -0.1064342 0.1081839 -0.0001307 0.0004541 0.0000335 -0.1386019 0.0676413 0.0162645 0.0002694 0.0885298 0.1632027 0.0001772 0.0003867 0.0001279 -0.1422529 -0.0285631 0.0430368 0.000308 0.0398403 -0.1365772 0.0000739 0.0001703 0.0000589 -0.1822718 0.0170674 -0.0003002 -0.0202348 0.0405901 0.0189048 0.0839558 -0.0164858 0.0932554 -0.0123546 0.0178295 -0.0015211 0.0191988 0.0394823 0.0212572 -0.0834315 0.0165814 -0.0925075 -0.0146954 0.1742808 0.0112006 -0.0003421 -0.0584664 0.097664 -0.0000344 -0.0005177 0.0003429 0.2997394 -0.0278121 -0.0753925 -0.0254505 -0.0257943 0.0171025 -0.0711666 0.0087403 -0.0607164 0.0072172 -0.0268676 -0.0754234 0.024632 -0.0249518 0.0156924 0.0711901 -0.0091141 0.0608908 0.009394 0.0388206 -0.1076889 -0.0002276 -0.0847678 -0.0866693 -0.0001696 -0.0002673 -0.0002275 0.1684509 0.1515953 0.0639447 -0.0001074 0.0458404 0.0720701 0.0000276 -0.0002112 0.0000323 0.1816882 -0.0155126 0.0988811 -0.0002109 0.1173222 -0.0356541 0.0001269 -0.0002459 0.0001265 0.1583012 0.0509697 -0.0556063 -0.0001425 -0.0833893 -0.0925012 -0.0001618 -0.0001368 -0.0001362 0.1534905 -0.1279948 -0.0392274 -0.0004391 -0.0398212 0.0836352 -0.000079 -0.0004883 -0.0000765 0.1696695 unknown
polarizability: 200.0790136|8.249462|115.1747301|0.1064237|0.0392743|54.1612202 unknown
InChI: InChI=1S/C9H10BrNO/c10-7-6-9(12)11-8-4-2-1-3-5-8/h1-5,11H,6-7H2
charge 0 multiplicity 1
22 atoms
Br 5.635289 0.572604 -0.003862
O  1.302473 -1.465099 0.001665
N  0.25701 0.642132 0.003198
C  2.711043 0.554413 0.004657
C  -1.129038 0.300495 0.001022
C  1.365825 -0.199289 0.005143
C  -2.062224 1.37229 -0.000174
C  -1.595329 -1.041147 0.000037
C  3.874925 -0.439609 -0.005362
C  -3.44628 1.109107 -0.002304
C  -2.985566 -1.28614 -0.002106
C  -3.917843 -0.224208 -0.003291
H  2.772528 1.215916 -0.880983
H  2.778435 1.204613 0.898211
H  0.456135 1.646274 0.003338
H  3.892029 -1.061936 -0.909671
H  3.897104 -1.073818 0.890502
H  -1.704636 2.410449 0.000594
H  -0.874683 -1.860423 0.000986
H  -4.154574 1.944641 -0.003191
H  -3.339772 -2.322942 -0.002854
H  -4.993249 -0.429621 -0.004956
