program: Gaussian 09
title: 000263612
version: EM64L-G09RevD.01
frameworkgroup: C1[X(C26H22Cl2N2O7)]
method: RPBEPBE
basis: SDD
operation: Freq
keyword: #p
keyword: freq=noraman
keyword: PBEPBE/SDD
title: #p freq=noraman PBEPBE/SDD
converged: YES YES NO NO
title: Mulliken charges:
elementType: Cl Cl O O O O O O O N N C C C C C C C C C C C C C C C C C C C C C C C C C C H H H H H H H H H H H H H H H H H H H H H H
charge: -0.038490 -0.034934 -0.250400 -0.305187 -0.301856 -0.276163 -0.248361 -0.241167 -0.277021 -0.188566 -0.407619 -0.071456 -0.106418 -0.514928 -0.015202 -0.281457 -0.210207 0.213785 0.211866 0.203936 0.077442 -0.553541 0.230425 0.236830 -0.045086 0.248246 -0.329541 -0.333151 -0.212798 -0.215213 -0.333077 -0.316595 -0.099775 -0.589460 -0.208366 -0.214186 -0.097758 0.286554 0.249471 0.265057 0.280879 0.282889 0.252130 0.243619 0.286473 0.362375 0.250162 0.240474 0.234521 0.275085 0.317549 0.263310 0.267023 0.271829 0.283726 0.225083 0.219637 0.263369 0.274232
chargesum: 0.00000
title: Mulliken charges with hydrogens summed into heavy atoms:
elementType: Cl Cl O O O O O O O N N C C C C C C C C C C C C C C C C C C C C C C C C C C
charge: -0.038490 -0.034934 -0.250400 -0.305187 -0.301856 -0.276163 -0.248361 -0.241167 -0.277021 -0.188566 -0.045243 0.215098 0.143053 0.031008 0.267687 0.214293 0.076267 0.213785 0.211866 0.203936 0.077442 -0.062905 0.230425 0.236830 0.189435 0.248246 -0.054456 -0.015602 0.050512 0.051810 -0.061248 -0.032869 -0.099775 -0.144740 0.055003 0.060045 -0.097758
polarizability: 4.57353290e+02 -2.87138894e+00 3.64358031e+02 -1.26143665e+01 -1.92966198e+01 2.27911245e+02
1716.lowfreq: -5.2238 -3.5541 -1.0183 -0.0012 -0.0010 0.0007 8.8137 11.0463 13.5218
frequency: 7.4317 10.9671 13.4992 20.7703 22.8727 35.3594 41.6104 46.6911 53.6404 56.4672 65.8405 73.6827 75.8366 87.6534 94.1985 98.7531 104.2674 139.5139 147.3123 157.2837 174.6273 179.4099 195.4717 210.0895 249.3193 251.5996 261.1269 267.4160 270.8187 280.6641 298.6936 300.1881 306.2839 326.9732 358.5619 387.0444 390.4534 404.6738 409.8052 411.3590 413.0912 438.3563 470.1681 475.4568 480.2905 487.0336 489.0234 500.8926 508.8634 544.5032 561.8992 596.4773 621.6976 622.0612 634.0798 650.9658 668.5621 670.9343 684.6185 695.7588 699.2736 716.7682 736.6472 739.5082 744.1788 750.6274 761.2284 779.9266 784.0083 801.6720 826.3598 841.2890 844.4498 852.1931 856.2563 860.9895 866.3786 885.6301 890.1337 923.1996 930.2007 935.5890 956.3900 966.4800 979.8063 983.9584 986.6495 990.7042 995.0254 996.1804 1004.2990 1014.9901 1022.1174 1034.0568 1048.5581 1051.5258 1071.3276 1071.4509 1075.5629 1111.0544 1113.0100 1114.2084 1124.3305 1127.7661 1144.3810 1170.7041 1179.8060 1187.0036 1206.1687 1222.2885 1222.9592 1234.7255 1244.5334 1245.2366 1266.6845 1280.6590 1286.0877 1290.7465 1295.3480 1297.4691 1301.5218 1306.6608 1329.9284 1338.6265 1355.1758 1366.3654 1368.3863 1374.5181 1377.1194 1382.5393 1397.9908 1399.2962 1427.2216 1432.9901 1448.7931 1457.6483 1464.0159 1471.9873 1474.0332 1573.2404 1574.6792 1596.2624 1597.0303 1616.0057 1617.8008 1623.3789 1633.8017 1656.6533 1664.8129 2978.6407 3024.5078 3027.9102 3039.6523 3044.9009 3058.8828 3081.3924 3095.1138 3101.1836 3105.0274 3122.1108 3157.0374 3157.6148 3162.0196 3169.2852 3170.1718 3176.8614 3178.5569 3180.0085 3188.4085 3197.8464 3524.2293
redmass: 6.3891 10.6247 7.1771 9.9927 7.9784 5.0078 4.8792 5.2716 3.8984 6.8317 4.7068 5.9801 5.9663 8.0382 8.8867 3.8886 10.5020 4.1437 6.6822 4.9851 7.3080 6.7255 4.5175 8.8062 8.2547 5.9091 6.1045 6.4323 7.4805 7.5732 6.4758 7.2123 6.7813 4.1117 3.7736 3.9057 3.5216 4.2957 2.9168 2.9554 4.1266 4.5718 3.7985 3.5547 3.9936 3.4886 3.3733 7.6942 6.8254 4.5462 6.5296 4.7452 7.1564 7.1603 3.0253 3.0802 4.9152 4.9031 7.2269 6.8933 2.5096 4.9870 3.5537 3.9150 4.0729 8.1473 4.7962 5.3304 2.3785 4.9081 3.6024 1.2451 1.3021 1.6038 1.4895 3.6891 2.6967 5.3711 1.6502 1.4960 3.0589 2.3311 1.4010 2.9743 1.3694 1.3577 1.4438 3.8240 3.0355 3.6595 1.4162 1.1808 3.3019 3.2578 3.5367 4.6615 2.9478 2.8763 3.8622 2.0981 1.5555 1.3655 2.0507 2.6879 2.6030 1.3922 1.1520 1.1345 2.3435 1.2506 1.5711 2.3584 1.4735 3.0580 1.9028 1.2644 1.3520 1.2556 1.4541 1.2583 1.4867 1.5772 1.5404 2.4182 1.2816 1.7227 1.4210 4.8784 5.6753 1.8984 4.3335 3.8126 1.2527 2.1452 1.0897 1.1013 1.0915 2.3976 2.3718 8.1098 8.0389 6.2713 6.1646 6.1879 10.4182 11.2823 9.6585 4.9495 5.9542 1.0599 1.0988 1.0588 1.0605 1.0842 1.0871 1.0717 1.0816 1.1074 1.1017 1.0878 1.0891 1.0890 1.0900 1.0932 1.0894 1.0967 1.0969 1.0980 1.0972 1.1145 1.0770
irintensity: 0.6308 0.0657 0.6269 0.1156 0.5843 0.9108 0.0619 0.3443 0.3671 1.3182 0.3238 0.6372 0.0295 1.1705 1.7798 0.5804 3.3261 2.6867 3.3563 0.4077 6.1533 0.3880 2.9687 1.7298 3.2647 5.6220 10.9042 1.8437 4.1247 19.0620 2.0471 5.8937 3.9257 15.2872 5.0659 4.1215 2.6768 12.4020 0.0432 0.7285 15.2106 4.2034 22.2577 3.1450 15.4998 3.1506 2.2010 28.0451 18.0320 28.2258 3.7267 12.6555 0.4985 1.4676 15.8671 15.3803 25.6160 21.6807 8.8867 11.5628 8.5132 3.8550 10.7043 29.8084 22.8397 15.3542 5.0300 15.5993 99.6432 2.9756 6.2130 1.1052 5.8009 53.1631 45.1646 6.1975 12.2229 59.8184 9.8630 8.3796 27.5336 1.8749 106.5773 8.8061 1.5137 0.4869 3.4913 76.3552 67.9889 103.8118 23.7062 21.5739 60.5316 108.2326 130.6522 409.7278 47.4206 48.1538 195.7650 7.3018 6.7915 5.8736 23.2841 17.1219 12.0698 21.5801 28.5990 17.4749 16.4343 4.4119 21.0120 144.8038 107.4039 510.1443 188.2388 3.2823 6.3523 0.9941 8.1697 3.0918 12.4360 30.5981 20.5018 95.7174 1.7838 55.6040 21.4811 8.6457 5.4697 5.9894 25.5805 28.0055 10.0119 87.6527 27.4448 9.4319 12.9889 36.0665 40.6515 18.4461 13.8258 147.3067 164.2289 258.7253 107.4941 273.4549 292.9706 194.7053 518.9831 11.3204 5.6094 16.7905 6.4597 12.1593 28.4898 16.3483 4.8282 8.0840 9.5066 4.2572 0.0545 0.0940 22.0726 0.8280 0.5506 2.1453 1.9839 13.4372 1.4794 21.9788 62.3915
temp: 298.150 k
press: 1.00000 atm
elementType: 17 17 8 8 8 8 8 8 8 7 7 6 6 6 6 6 6 6 6 6 6 6 6 6 6 6 6 6 6 6 6 6 6 6 6 6 6 1 1 1 1 1 1 1 1 1 1 1 1 1 1 1 1 1 1 1 1 1 1
symmnumber: 1
zpe: 1140720.5 jmol-1
zpe.correction: 0.434477 hartree
zpe.thermalcorrener: 0.468589 hartree
zpe.thermalcorrenthalpy: 0.469534 hartree
zpe.thermalcorrgfe: 0.361160 hartree
zpe.sumelectzpe: -2557.536957 hartree
zpe.sumelectthermal: -2557.502845 hartree
zpe.sumelectthermalent: -2557.501901 hartree
zpe.sumelectthermalfe: -2557.610275 hartree
dipole: -1.9818 -2.7043 1.5270
dipole: 3.6841
quadrupole: -263.4397 -229.4119 -225.9713
quadrupole: -9.5859 7.5834 -1.2043
quadrupole: -23.8321 10.1958 13.6363 -9.5859 7.5834 -1.2043
hfenergy: -2557.9714347 hartree
pointgroup: C01 [X(C26H22Cl2N2O7)]
dipole: -0.5066276 -0.0231696 -1.3578167 debye
polarizability: 452.0625044|-17.0250012|235.8540275|17.6385248|-38.2816786|361.7060339 unknown
InChI: InChI=1S/C26H22Cl2N2O7/c1-2-3-17-13-30(26(34)29-23(17)31)22-12-20(37-25(33)16-6-10-19(28)11-7-16)21(36-22)14-35-24(32)15-4-8-18(27)9-5-15/h2,4-11,13,20-22,29H,1,3,12,14H2
charge 0 multiplicity 1
59 atoms
Cl -6.907937 2.837309 -3.489735
Cl -3.401496 -0.767808 6.201376
O  1.957868 -1.830067 -0.83469
O  -0.797401 0.30328 -1.880245
O  -0.824634 -2.119265 0.059473
O  2.39148 -1.486384 3.027452
O  -0.112841 2.457409 -2.460981
O  6.872359 -0.243389 2.571825
O  -3.059157 -1.882907 -0.581009
N  3.13511 -0.718737 0.917807
N  4.625615 -0.850332 2.73786
C  0.618237 -0.032441 -1.62014
C  0.800961 -1.57166 -1.715913
C  1.088046 0.345984 -0.190628
C  1.803372 -0.926966 0.342891
C  -0.420911 -2.418579 -1.337013
C  4.184821 -0.248342 0.124012
C  3.318447 -1.05601 2.284348
C  5.461346 -0.05384 0.593499
C  -1.039379 1.621938 -2.322149
C  5.749836 -0.366683 2.002149
C  6.59827 0.476702 -0.264824
C  -2.479489 1.869181 -2.592117
C  -2.181796 -1.882214 0.31838
C  6.423007 0.224888 -1.74796
C  -2.431468 -1.628801 1.764022
C  -2.844476 3.151661 -3.082564
C  -3.477795 0.882153 -2.375133
C  -4.191353 3.453185 -3.359766
C  -4.829609 1.176512 -2.649379
C  -3.75256 -1.281047 2.153073
C  -1.408598 -1.718379 2.746411
C  -5.164386 2.455976 -3.1375
C  6.381868 1.188591 -2.702153
C  -4.054813 -1.017459 3.502705
C  -1.700246 -1.456172 4.100632
C  -3.019225 -1.108074 4.456794
H  1.236845 0.478161 -2.377405
H  1.116772 -1.884339 -2.726837
H  0.216239 0.581641 0.441394
H  1.753272 1.223392 -0.20575
H  1.210954 -1.432093 1.116839
H  -1.269918 -2.224517 -2.014937
H  -0.143887 -3.486445 -1.360035
H  3.928755 -0.059346 -0.921582
H  4.793356 -1.080515 3.72275
H  7.532121 0.002202 0.097949
H  6.726751 1.561038 -0.077519
H  6.3426 -0.832486 -2.045377
H  -2.06149 3.900087 -3.240898
H  -3.210088 -0.104206 -1.985753
H  -4.481633 4.436899 -3.738346
H  -5.60564 0.424085 -2.484514
H  -4.530784 -1.220478 1.385784
H  -0.390005 -2.00132 2.469684
H  6.458537 2.253277 -2.447798
H  6.282107 0.94093 -3.764898
H  -5.068878 -0.747594 3.809623
H  -0.914759 -1.522488 4.858114
