program: Gaussian 09
title: 000263596
version: EM64L-G09RevD.01
frameworkgroup: C1[X(C18H18O3)]
method: RPBEPBE
basis: SDD
operation: Freq
keyword: #pfreq=noraman
keyword: PBEPBE/SDD
title: #p freq=noraman PBEPBE/SDD
converged: YES YES NO NO
title: Mulliken charges:
elementType: O O O C C C C C C C C C C C C C C C C C C H H H H H H H H H H H H H H H H H H
charge: -0.309590 -0.258742 -0.214740 0.344221 -0.709176 -0.708088 -0.724964 0.138196 0.161322 0.224790 -0.378315 0.031907 -0.361253 0.306006 -0.226672 -0.233887 -0.338453 -0.373217 -0.238934 -0.229457 -0.229567 0.218784 0.210998 0.265838 0.243487 0.223212 0.202307 0.259043 0.207972 0.255552 0.272319 0.259011 0.237353 0.236329 0.260389 0.276380 0.232127 0.233757 0.233754
chargesum: 0.00000
title: Mulliken charges with hydrogens summed into heavy atoms:
elementType: O O O C C C C C C C C C C C C C C C C C C
charge: -0.309590 -0.258742 -0.214740 0.344221 -0.013557 -0.039082 -0.002397 0.138196 0.161322 0.224790 -0.105996 0.031907 -0.102243 0.306006 0.010681 0.002442 -0.078064 -0.096836 -0.006807 0.004300 0.004187
polarizability: 2.37327771e+02 -2.27651209e+01 2.22113551e+02 -6.85691745e+00 -1.71147892e+01 1.48220123e+02
1716.lowfreq: -3.6912 -0.4997 -0.0005 0.0002 0.0004 5.3084 13.6393 31.6695 39.2695
frequency: 13.0068 31.5903 39.2411 55.4805 70.4975 86.4194 116.4281 149.1605 155.8114 168.7162 175.3606 195.5148 230.1627 239.9734 241.9030 245.7364 302.0197 317.9794 334.4798 355.7310 384.0695 401.8665 410.1419 431.1755 437.2448 450.4746 458.6364 511.2085 579.7095 613.5406 629.1308 651.4632 673.6764 692.1106 706.5779 712.8245 726.6067 773.4835 787.5359 798.1879 809.2124 826.7357 863.5669 897.3241 918.1791 918.9349 922.8204 950.5509 958.0871 972.1256 989.5253 993.5688 1000.8576 1008.9789 1024.4440 1030.5570 1031.5553 1036.1591 1068.1109 1083.4977 1103.9934 1154.0321 1173.1618 1174.1612 1176.7127 1186.5573 1243.5787 1257.2934 1269.3177 1274.9546 1279.8814 1316.5675 1374.7952 1375.2674 1380.8135 1387.5268 1402.2351 1428.0384 1435.0617 1445.0436 1466.5399 1467.0106 1469.6183 1471.8870 1478.5257 1479.7039 1501.9432 1549.5160 1574.7850 1591.0359 1598.9891 1609.1348 1610.0821 2989.0138 2990.7402 2995.6632 3081.0777 3086.6742 3094.5417 3098.8438 3114.2068 3117.4891 3128.9011 3131.2728 3138.8118 3143.4134 3149.8098 3155.3043 3158.6373 3169.1323 3169.9406
redmass: 4.3584 4.3385 3.6759 4.0522 4.3833 5.1139 4.8219 5.2213 3.7668 3.1438 1.2838 4.8551 1.3955 2.8052 1.6529 1.6139 3.1708 6.4978 2.8445 5.2606 3.5764 2.8335 3.0140 3.6945 4.1894 2.9444 3.7862 4.2274 4.6695 6.4533 6.2856 6.3852 5.5570 3.2384 1.7314 5.8481 5.8656 1.8558 2.6100 2.8692 3.2196 4.4726 1.2467 1.5627 3.4381 1.6730 1.7069 1.4488 1.2035 1.4079 6.1567 1.3854 1.3440 1.3369 2.1985 1.5573 2.4712 1.4956 3.7570 1.5809 2.1645 2.4102 1.8191 1.1158 1.0738 1.1618 2.9662 3.0560 2.1779 3.7804 2.1352 1.3582 6.2366 1.3265 1.2286 9.2318 1.2137 2.1900 2.2624 1.0464 1.0648 1.0517 1.4502 1.5207 2.3409 1.0603 1.0584 9.7749 6.9962 6.5535 6.6737 6.5514 8.2066 1.0360 1.0358 1.0366 1.0990 1.0993 1.0992 1.1004 1.1002 1.0995 1.0851 1.0859 1.0880 1.0898 1.0923 1.0945 1.0962 1.1013 1.1006
irintensity: 0.3096 0.8872 0.6024 3.0345 1.1418 1.8581 0.2961 0.8557 0.0486 2.5899 0.7550 2.3659 0.3157 1.9597 0.1351 1.4190 4.6335 2.6633 1.0837 8.7293 3.7674 0.0462 0.3525 1.1203 0.3301 1.9610 3.9325 2.8798 2.4430 0.2022 21.8158 8.2179 5.0652 6.8067 128.4208 1.2916 20.6010 39.2545 13.5311 22.3582 2.3464 11.0581 1.9423 11.3189 34.2966 5.8035 6.7754 2.8386 0.1506 1.5755 1.6755 1.4883 1.5867 1.1015 3.0562 13.2842 57.1527 8.2307 121.0182 8.5779 125.7223 13.1487 144.9698 17.7765 2.0729 19.8716 101.0906 24.9766 2.1114 300.7870 50.7829 13.2874 25.5041 34.7687 38.3373 3.1986 35.2901 4.6382 18.3467 0.6866 16.5432 4.1554 17.1895 1.0927 4.6561 4.6579 28.0822 138.3689 35.6994 20.1045 60.5548 8.0736 99.3744 15.4836 16.1833 28.7463 11.0898 3.7185 62.7515 28.1614 3.2379 15.4592 0.1440 1.0837 5.9479 10.2625 12.4475 9.9138 20.1842 26.9985 21.1265
temp: 298.150 k
press: 1.00000 atm
elementType: 8 8 8 6 6 6 6 6 6 6 6 6 6 6 6 6 6 6 6 6 6 1 1 1 1 1 1 1 1 1 1 1 1 1 1 1 1 1 1
symmnumber: 1
zpe: 815140.8 jmol-1
zpe.correction: 0.310471 hartree
zpe.thermalcorrener: 0.330464 hartree
zpe.thermalcorrenthalpy: 0.331408 hartree
zpe.thermalcorrgfe: 0.260454 hartree
zpe.sumelectzpe: -920.894245 hartree
zpe.sumelectthermal: -920.874252 hartree
zpe.sumelectthermalent: -920.873308 hartree
zpe.sumelectthermalfe: -920.944262 hartree
dipole: 3.5690 0.2436 -2.8877
dipole: 4.5973
quadrupole: -118.2096 -103.7687 -125.8177
quadrupole: -1.1039 1.7734 -3.0648
quadrupole: -2.2776 12.1633 -9.8857 -1.1039 1.7734 -3.0648
hfenergy: -921.2047159 hartree
pointgroup: C01 [X(C18H18O3)]
dipole: 0.9713525 -0.535316 1.4287869 debye
polarizability: 252.5967993|7.3251298|195.6419688|9.2461761|-28.0148347|159.4226776 unknown
InChI: InChI=1S/C18H18O3/c1-18(2,3)21-17(20)15-12-8-7-11-14(15)16(19)13-9-5-4-6-10-13/h4-12H,1-3H3
charge 0 multiplicity 1
39 atoms
O  -0.725138 1.696679 0.04373
O  -2.896724 1.820165 -0.845235
O  0.553395 -0.252368 -1.793761
C  -0.320998 3.130786 -0.313759
C  -1.254839 4.115252 0.416859
C  1.116595 3.198126 0.228201
C  -0.359048 3.284304 -1.846985
C  -2.002577 -0.305408 -0.060938
C  -1.940138 1.16711 -0.357011
C  -0.854654 -1.150059 -0.058005
C  -3.272725 -0.840664 0.262592
C  0.483386 -0.703292 -0.610672
C  -1.006106 -2.511457 0.308257
C  1.715705 -0.878171 0.225811
C  -3.414167 -2.201009 0.608133
C  -2.274738 -3.036796 0.63934
C  1.650677 -1.085852 1.629478
C  2.985206 -0.786018 -0.407377
C  2.837048 -1.203559 2.385609
C  4.167672 -0.912201 0.346806
C  4.096209 -1.121921 1.746579
H  -1.25716 3.913794 1.502914
H  -0.891063 5.147397 0.259157
H  -2.285059 4.040482 0.035433
H  1.754237 2.448492 -0.270618
H  1.133195 3.003653 1.314674
H  1.538722 4.202211 0.043422
H  -1.392697 3.254667 -2.226002
H  0.091897 4.254137 -2.126299
H  0.22076 2.475231 -2.324225
H  -4.138246 -0.170628 0.237239
H  -0.129538 -3.168654 0.303749
H  -4.401862 -2.604196 0.855389
H  -2.372417 -4.094178 0.908173
H  0.676533 -1.134426 2.127087
H  3.013019 -0.614364 -1.48882
H  2.782072 -1.354749 3.4692
H  5.143158 -0.847909 -0.147544
H  5.01631 -1.217605 2.33412
